null
SMILES: CN1CCN(Cc2ccc(cc2)C(=O)Nc2ccc(C)c(Nc3nccc(n3)-c3cncc(c3)-c3cc(C)no3)c2)CC1
InChI Key:
Activity Spreadsheet -- Enzyme Inhibition Constant Data from BindingDB
Found 3 hits for monomerid = 612791
Trg + Lig
Ki
nM
ΔG°
kcal/mole
IC50
nM
Kd
nM
EC50/IC50
nM
koff
s-1
kon
M-1s-1
pHTemp
°C
Tyrosine-protein kinase ABL1
(Homo sapiens (Human))
BDBM612791
(US11725005, Compound 207)
Show SMILES CN1CCN(Cc2ccc(cc2)C(=O)Nc2ccc(C)c(Nc3nccc(n3)-c3cncc(c3)-c3cc(C)no3)c2)CC1
Reactome pathway
n/an/a 30.2n/an/an/an/an/an/a
TBA
Citation and Details
BindingDB Entry DOI: 10.7270/Q2R215H9
Mast/stem cell growth factor receptor Kit
(Homo sapiens (Human))
BDBM612791
(US11725005, Compound 207)
Show SMILES CN1CCN(Cc2ccc(cc2)C(=O)Nc2ccc(C)c(Nc3nccc(n3)-c3cncc(c3)-c3cc(C)no3)c2)CC1
n/an/a 12.2n/an/an/an/an/an/a
TBA
Citation and Details
BindingDB Entry DOI: 10.7270/Q2R215H9
Tyrosine-protein kinase ABL2
(Homo sapiens (Human))
BDBM612791
(US11725005, Compound 207)
Show SMILES CN1CCN(Cc2ccc(cc2)C(=O)Nc2ccc(C)c(Nc3nccc(n3)-c3cncc(c3)-c3cc(C)no3)c2)CC1
Reactome pathway
n/an/a 73.7n/an/an/an/an/an/a
TBA
Citation and Details
BindingDB Entry DOI: 10.7270/Q2R215H9