null
SMILES: O=C(CNC(=O)c1ccnc2ccc(cc12)N1CCC11CCC1)N1CSC[C@H]1C#N
InChI Key:
Activity Spreadsheet -- Enzyme Inhibition Constant Data from BindingDB
Found 6 hits for monomerid = 622059
Trg + Lig
Ki
nM
ΔG°
kcal/mole
IC50
nM
Kd
nM
EC50/IC50
nM
koff
s-1
kon
M-1s-1
pHTemp
°C
Presequence protease, mitochondrial
(Homo sapiens (Human))
BDBM622059
(US20230312550, Example 19)
Show SMILES O=C(CNC(=O)c1ccnc2ccc(cc12)N1CCC11CCC1)N1CSC[C@H]1C#N |r|
n/an/a 160n/an/an/an/an/an/a
TBA
Citation and Details
Prolyl endopeptidase FAP
(Homo sapiens (Human))
BDBM622059
(US20230312550, Example 19)
Show SMILES O=C(CNC(=O)c1ccnc2ccc(cc12)N1CCC11CCC1)N1CSC[C@H]1C#N |r|
n/an/an/an/an/an/a 4.30E+5n/an/a
TBA
Citation and Details
Prolyl endopeptidase FAP
(Homo sapiens (Human))
BDBM622059
(US20230312550, Example 19)
Show SMILES O=C(CNC(=O)c1ccnc2ccc(cc12)N1CCC11CCC1)N1CSC[C@H]1C#N |r|
n/an/an/a 0.150n/an/an/an/an/a
TBA
Citation and Details
Prolyl endopeptidase FAP
(Homo sapiens (Human))
BDBM622059
(US20230312550, Example 19)
Show SMILES O=C(CNC(=O)c1ccnc2ccc(cc12)N1CCC11CCC1)N1CSC[C@H]1C#N |r|
n/an/a 0.660n/an/an/an/an/an/a
TBA
Citation and Details
Prolyl endopeptidase FAP
(Homo sapiens (Human))
BDBM622059
(US20230312550, Example 19)
Show SMILES O=C(CNC(=O)c1ccnc2ccc(cc12)N1CCC11CCC1)N1CSC[C@H]1C#N |r|
n/an/a 0.380n/an/an/an/an/an/a
TBA
Citation and Details
Prolyl endopeptidase FAP
(Homo sapiens (Human))
BDBM622059
(US20230312550, Example 19)
Show SMILES O=C(CNC(=O)c1ccnc2ccc(cc12)N1CCC11CCC1)N1CSC[C@H]1C#N |r|
n/an/an/an/an/a 0.0000660n/an/an/a
TBA
Citation and Details