null
SMILES: FC[C@H]1CC2(CC2)CN1c1ccc2nccc(C(=O)NCC(=O)N3CSC[C@H]3C#N)c2c1
InChI Key:
Activity Spreadsheet -- Enzyme Inhibition Constant Data from BindingDB
Found 6 hits for monomerid = 622098
Trg + Lig
Ki
nM
ΔG°
kcal/mole
IC50
nM
Kd
nM
EC50/IC50
nM
koff
s-1
kon
M-1s-1
pHTemp
°C
Presequence protease, mitochondrial
(Homo sapiens (Human))
BDBM622098
(US20230312550, Example 58)
Show SMILES FC[C@H]1CC2(CC2)CN1c1ccc2nccc(C(=O)NCC(=O)N3CSC[C@H]3C#N)c2c1 |r|
n/an/a 180n/an/an/an/an/an/a
TBA
Citation and Details
Prolyl endopeptidase FAP
(Homo sapiens (Human))
BDBM622098
(US20230312550, Example 58)
Show SMILES FC[C@H]1CC2(CC2)CN1c1ccc2nccc(C(=O)NCC(=O)N3CSC[C@H]3C#N)c2c1 |r|
n/an/a 0.230n/an/an/an/an/an/a
TBA
Citation and Details
Prolyl endopeptidase FAP
(Homo sapiens (Human))
BDBM622098
(US20230312550, Example 58)
Show SMILES FC[C@H]1CC2(CC2)CN1c1ccc2nccc(C(=O)NCC(=O)N3CSC[C@H]3C#N)c2c1 |r|
n/an/an/an/an/a 0.0910n/an/an/a
TBA
Citation and Details
Prolyl endopeptidase FAP
(Homo sapiens (Human))
BDBM622098
(US20230312550, Example 58)
Show SMILES FC[C@H]1CC2(CC2)CN1c1ccc2nccc(C(=O)NCC(=O)N3CSC[C@H]3C#N)c2c1 |r|
n/an/an/a 0.0160n/an/an/an/an/a
TBA
Citation and Details
Prolyl endopeptidase FAP
(Homo sapiens (Human))
BDBM622098
(US20230312550, Example 58)
Show SMILES FC[C@H]1CC2(CC2)CN1c1ccc2nccc(C(=O)NCC(=O)N3CSC[C@H]3C#N)c2c1 |r|
n/an/an/an/an/an/a 8.80E+9n/an/a
TBA
Citation and Details
Prolyl endopeptidase FAP
(Homo sapiens (Human))
BDBM622098
(US20230312550, Example 58)
Show SMILES FC[C@H]1CC2(CC2)CN1c1ccc2nccc(C(=O)NCC(=O)N3CSC[C@H]3C#N)c2c1 |r|
n/an/a 0.0760n/an/an/an/an/an/a
TBA
Citation and Details