null
SMILES: Fc1cc(F)c2ccn(-c3ccc4nccc(C(=O)NCC(=O)N5CSC[C@H]5C#N)c4c3)c2c1
InChI Key:
Activity Spreadsheet -- Enzyme Inhibition Constant Data from BindingDB
Found 5 hits for monomerid = 622159
Trg + Lig
Ki
nM
ΔG°
kcal/mole
IC50
nM
Kd
nM
EC50/IC50
nM
koff
s-1
kon
M-1s-1
pHTemp
°C
Presequence protease, mitochondrial
(Homo sapiens (Human))
BDBM622159
(US20230312550, Example 119)
Show SMILES Fc1cc(F)c2ccn(-c3ccc4nccc(C(=O)NCC(=O)N5CSC[C@H]5C#N)c4c3)c2c1 |r|
n/an/a 76n/an/an/an/an/an/a
TBA
Citation and Details
Prolyl endopeptidase FAP
(Homo sapiens (Human))
BDBM622159
(US20230312550, Example 119)
Show SMILES Fc1cc(F)c2ccn(-c3ccc4nccc(C(=O)NCC(=O)N5CSC[C@H]5C#N)c4c3)c2c1 |r|
n/an/a 0.160n/an/an/an/an/an/a
TBA
Citation and Details
Prolyl endopeptidase FAP
(Homo sapiens (Human))
BDBM622159
(US20230312550, Example 119)
Show SMILES Fc1cc(F)c2ccn(-c3ccc4nccc(C(=O)NCC(=O)N5CSC[C@H]5C#N)c4c3)c2c1 |r|
n/an/an/an/an/a 0.000310n/an/an/a
TBA
Citation and Details
Prolyl endopeptidase FAP
(Homo sapiens (Human))
BDBM622159
(US20230312550, Example 119)
Show SMILES Fc1cc(F)c2ccn(-c3ccc4nccc(C(=O)NCC(=O)N5CSC[C@H]5C#N)c4c3)c2c1 |r|
n/an/an/an/an/an/a 6.10E+5n/an/a
TBA
Citation and Details
Prolyl endopeptidase FAP
(Homo sapiens (Human))
BDBM622159
(US20230312550, Example 119)
Show SMILES Fc1cc(F)c2ccn(-c3ccc4nccc(C(=O)NCC(=O)N5CSC[C@H]5C#N)c4c3)c2c1 |r|
n/an/an/a 0.390n/an/an/an/an/a
TBA
Citation and Details