null
SMILES: Cc1ccn(c1)-c1ccc2nccc(C(=O)NCC(=O)N3CSC[C@H]3C#N)c2c1
InChI Key:
Activity Spreadsheet -- Enzyme Inhibition Constant Data from BindingDB
Found 5 hits for monomerid = 622161
Trg + Lig
Ki
nM
ΔG°
kcal/mole
IC50
nM
Kd
nM
EC50/IC50
nM
koff
s-1
kon
M-1s-1
pHTemp
°C
Presequence protease, mitochondrial
(Homo sapiens (Human))
BDBM622161
(US20230312550, Example 121)
Show SMILES Cc1ccn(c1)-c1ccc2nccc(C(=O)NCC(=O)N3CSC[C@H]3C#N)c2c1 |r|
n/an/a 88n/an/an/an/an/an/a
TBA
Citation and Details
Prolyl endopeptidase FAP
(Homo sapiens (Human))
BDBM622161
(US20230312550, Example 121)
Show SMILES Cc1ccn(c1)-c1ccc2nccc(C(=O)NCC(=O)N3CSC[C@H]3C#N)c2c1 |r|
n/an/a 0.150n/an/an/an/an/an/a
TBA
Citation and Details
Prolyl endopeptidase FAP
(Homo sapiens (Human))
BDBM622161
(US20230312550, Example 121)
Show SMILES Cc1ccn(c1)-c1ccc2nccc(C(=O)NCC(=O)N3CSC[C@H]3C#N)c2c1 |r|
n/an/an/an/an/a 0.0000160n/an/an/a
TBA
Citation and Details
Prolyl endopeptidase FAP
(Homo sapiens (Human))
BDBM622161
(US20230312550, Example 121)
Show SMILES Cc1ccn(c1)-c1ccc2nccc(C(=O)NCC(=O)N3CSC[C@H]3C#N)c2c1 |r|
n/an/an/an/an/an/a 1.10E+6n/an/a
TBA
Citation and Details
Prolyl endopeptidase FAP
(Homo sapiens (Human))
BDBM622161
(US20230312550, Example 121)
Show SMILES Cc1ccn(c1)-c1ccc2nccc(C(=O)NCC(=O)N3CSC[C@H]3C#N)c2c1 |r|
n/an/an/a 0.0120n/an/an/an/an/a
TBA
Citation and Details