null
SMILES: O=C(CNC(=O)c1ccnc2ccc(cc12)-c1ccn[nH]1)N1CSC[C@H]1C#N
InChI Key:
Activity Spreadsheet -- Enzyme Inhibition Constant Data from BindingDB
Found 6 hits for monomerid = 622236
Trg + Lig
Ki
nM
ΔG°
kcal/mole
IC50
nM
Kd
nM
EC50/IC50
nM
koff
s-1
kon
M-1s-1
pHTemp
°C
Prolyl endopeptidase FAP
(Homo sapiens (Human))
BDBM622236
(US20230312550, Example 196)
Show SMILES O=C(CNC(=O)c1ccnc2ccc(cc12)-c1ccn[nH]1)N1CSC[C@H]1C#N |r|
n/an/a 0.190n/an/an/an/an/an/a
TBA
Citation and Details
Prolyl endopeptidase FAP
(Homo sapiens (Human))
BDBM622236
(US20230312550, Example 196)
Show SMILES O=C(CNC(=O)c1ccnc2ccc(cc12)-c1ccn[nH]1)N1CSC[C@H]1C#N |r|
n/an/a 0.0660n/an/an/an/an/an/a
TBA
Citation and Details
Prolyl endopeptidase FAP
(Homo sapiens (Human))
BDBM622236
(US20230312550, Example 196)
Show SMILES O=C(CNC(=O)c1ccnc2ccc(cc12)-c1ccn[nH]1)N1CSC[C@H]1C#N |r|
n/an/an/an/an/a 0.000260n/an/an/a
TBA
Citation and Details
Presequence protease, mitochondrial
(Homo sapiens (Human))
BDBM622236
(US20230312550, Example 196)
Show SMILES O=C(CNC(=O)c1ccnc2ccc(cc12)-c1ccn[nH]1)N1CSC[C@H]1C#N |r|
n/an/a 84n/an/an/an/an/an/a
TBA
Citation and Details
Prolyl endopeptidase FAP
(Homo sapiens (Human))
BDBM622236
(US20230312550, Example 196)
Show SMILES O=C(CNC(=O)c1ccnc2ccc(cc12)-c1ccn[nH]1)N1CSC[C@H]1C#N |r|
n/an/an/an/an/an/a 3.20E+6n/an/a
TBA
Citation and Details
Prolyl endopeptidase FAP
(Homo sapiens (Human))
BDBM622236
(US20230312550, Example 196)
Show SMILES O=C(CNC(=O)c1ccnc2ccc(cc12)-c1ccn[nH]1)N1CSC[C@H]1C#N |r|
n/an/an/a 0.0800n/an/an/an/an/a
TBA
Citation and Details