null
SMILES: Cc1noc(C)c1-c1ccc2nccc(C(=O)NCC(=O)N3CSC[C@H]3C#N)c2c1
InChI Key:
Activity Spreadsheet -- Enzyme Inhibition Constant Data from BindingDB
Found 6 hits for monomerid = 622256
Trg + Lig
Ki
nM
ΔG°
kcal/mole
IC50
nM
Kd
nM
EC50/IC50
nM
koff
s-1
kon
M-1s-1
pHTemp
°C
Prolyl endopeptidase FAP
(Homo sapiens (Human))
BDBM622256
(US20230312550, Example 216)
Show SMILES Cc1noc(C)c1-c1ccc2nccc(C(=O)NCC(=O)N3CSC[C@H]3C#N)c2c1 |r|
n/an/a 2.40n/an/an/an/an/an/a
TBA
Citation and Details
Prolyl endopeptidase FAP
(Homo sapiens (Human))
BDBM622256
(US20230312550, Example 216)
Show SMILES Cc1noc(C)c1-c1ccc2nccc(C(=O)NCC(=O)N3CSC[C@H]3C#N)c2c1 |r|
n/an/a 1.70n/an/an/an/an/an/a
TBA
Citation and Details
Prolyl endopeptidase FAP
(Homo sapiens (Human))
BDBM622256
(US20230312550, Example 216)
Show SMILES Cc1noc(C)c1-c1ccc2nccc(C(=O)NCC(=O)N3CSC[C@H]3C#N)c2c1 |r|
n/an/an/an/an/a 0.000900n/an/an/a
TBA
Citation and Details
Presequence protease, mitochondrial
(Homo sapiens (Human))
BDBM622256
(US20230312550, Example 216)
Show SMILES Cc1noc(C)c1-c1ccc2nccc(C(=O)NCC(=O)N3CSC[C@H]3C#N)c2c1 |r|
n/an/a 190n/an/an/an/an/an/a
TBA
Citation and Details
Prolyl endopeptidase FAP
(Homo sapiens (Human))
BDBM622256
(US20230312550, Example 216)
Show SMILES Cc1noc(C)c1-c1ccc2nccc(C(=O)NCC(=O)N3CSC[C@H]3C#N)c2c1 |r|
n/an/an/an/an/an/a 5.20E+6n/an/a
TBA
Citation and Details
Prolyl endopeptidase FAP
(Homo sapiens (Human))
BDBM622256
(US20230312550, Example 216)
Show SMILES Cc1noc(C)c1-c1ccc2nccc(C(=O)NCC(=O)N3CSC[C@H]3C#N)c2c1 |r|
n/an/an/a 0.270n/an/an/an/an/a
TBA
Citation and Details