BDBM65114 US10166249, Example 474::US9522888, 474
SMILES: Cc1ccc(COC[C@@H]2CCc3cc(ccc3C2)[C@H]2CC[C@](N)(COP(O)(O)=O)C2)cc1
InChI Key: InChIKey=NFVZGWFEZMNUFL-DCEDVJGZSA-N
Data: 2 IC50  6 EC50
Activity Spreadsheet -- Enzyme Inhibition Constant Data from BindingDB
Found 8 hits for monomerid = 65114
Trg + Lig
Ki
nM
ΔG°
kcal/mole
IC50
nM
Kd
nM
EC50/IC50
nM
koff
s-1
kon
M-1s-1
pHTemp
°C
Sphingosine 1-phosphate receptor 1
(Homo sapiens (Human))
BDBM65114
(US10166249, Example 474 | US9522888, 474)
Show SMILES Cc1ccc(COC[C@@H]2CCc3cc(ccc3C2)[C@H]2CC[C@](N)(COP(O)(O)=O)C2)cc1 |r|
Show InChI InChI=1S/C25H34NO5P/c1-18-2-4-19(5-3-18)15-30-16-20-6-7-22-13-23(9-8-21(22)12-20)24-10-11-25(26,14-24)17-31-32(27,28)29/h2-5,8-9,13,20,24H,6-7,10-12,14-17,26H2,1H3,(H2,27,28,29)/t20-,24+,25-/m1/s1
Reactome pathway
US Patent
n/an/a<10n/an/an/an/a7.525
Bristol-Myers Squibb Company
US Patent
Assay Description
Membranes were prepared from CHO cells expressing human S1P1. Cells pellets (1x10^9 cells/pellet) were suspended in buffer containing 20 mM HEPES (4-...
US Patent US9522888 (2016)
BindingDB Entry DOI: 10.7270/Q20K27HV
Sphingosine 1-phosphate receptor 1
(Homo sapiens (Human))
BDBM65114
(US10166249, Example 474 | US9522888, 474)
Show SMILES Cc1ccc(COC[C@@H]2CCc3cc(ccc3C2)[C@H]2CC[C@](N)(COP(O)(O)=O)C2)cc1 |r|
Show InChI InChI=1S/C25H34NO5P/c1-18-2-4-19(5-3-18)15-30-16-20-6-7-22-13-23(9-8-21(22)12-20)24-10-11-25(26,14-24)17-31-32(27,28)29/h2-5,8-9,13,20,24H,6-7,10-12,14-17,26H2,1H3,(H2,27,28,29)/t20-,24+,25-/m1/s1
Reactome pathway
US Patent
n/an/an/an/a 55n/an/an/a60
Bristol-Myers Squibb Company
US Patent
Assay Description
Compounds were loaded in a 384 Falcon v-bottom plate (0.5 ul/well in a 11 point, 3-fold dilution). Membranes prepared from S1P1/CHO cells or EDG3-Gal...
US Patent US9522888 (2016)
BindingDB Entry DOI: 10.7270/Q20K27HV
Sphingosine 1-phosphate receptor 1
(Homo sapiens (Human))
BDBM65114
(US10166249, Example 474 | US9522888, 474)
Show SMILES Cc1ccc(COC[C@@H]2CCc3cc(ccc3C2)[C@H]2CC[C@](N)(COP(O)(O)=O)C2)cc1 |r|
Show InChI InChI=1S/C25H34NO5P/c1-18-2-4-19(5-3-18)15-30-16-20-6-7-22-13-23(9-8-21(22)12-20)24-10-11-25(26,14-24)17-31-32(27,28)29/h2-5,8-9,13,20,24H,6-7,10-12,14-17,26H2,1H3,(H2,27,28,29)/t20-,24+,25-/m1/s1
Reactome pathway
US Patent
n/an/an/an/a<10n/an/an/a37
Bristol-Myers Squibb Company
US Patent
Assay Description
hS1P1/CHO cells were plated into BD Amine 384-well plates the day before the assay. On the day of the assay, growth medium was removed and replaced w...
US Patent US9522888 (2016)
BindingDB Entry DOI: 10.7270/Q20K27HV
Sphingosine 1-phosphate receptor 3
(Homo sapiens (Human))
BDBM65114
(US10166249, Example 474 | US9522888, 474)
Show SMILES Cc1ccc(COC[C@@H]2CCc3cc(ccc3C2)[C@H]2CC[C@](N)(COP(O)(O)=O)C2)cc1 |r|
Show InChI InChI=1S/C25H34NO5P/c1-18-2-4-19(5-3-18)15-30-16-20-6-7-22-13-23(9-8-21(22)12-20)24-10-11-25(26,14-24)17-31-32(27,28)29/h2-5,8-9,13,20,24H,6-7,10-12,14-17,26H2,1H3,(H2,27,28,29)/t20-,24+,25-/m1/s1
NCI pathway
Reactome pathway
US Patent
n/an/an/an/a>625n/an/an/an/a
Bristol-Myers Squibb Company
US Patent
Assay Description
Compounds were loaded in a 384 Falcon v-bottom plate (0.5 l/well in a 11 point, 3-fold dilution). Membranes prepared from S1P1/CHO cells or EDG3-Gal5...
US Patent US10166249 (2019)
BindingDB Entry DOI: 10.7270/Q2S75JCM
Sphingosine-1-phosphate lyase 1
(Homo sapiens (Human))
BDBM65114
(US10166249, Example 474 | US9522888, 474)
Show SMILES Cc1ccc(COC[C@@H]2CCc3cc(ccc3C2)[C@H]2CC[C@](N)(COP(O)(O)=O)C2)cc1 |r|
Show InChI InChI=1S/C25H34NO5P/c1-18-2-4-19(5-3-18)15-30-16-20-6-7-22-13-23(9-8-21(22)12-20)24-10-11-25(26,14-24)17-31-32(27,28)29/h2-5,8-9,13,20,24H,6-7,10-12,14-17,26H2,1H3,(H2,27,28,29)/t20-,24+,25-/m1/s1
US Patent
n/an/a<10n/an/an/an/an/an/a
Bristol-Myers Squibb Company
US Patent
Assay Description
Membranes were prepared from CHO cells expressing human S1P1. Cells pellets (1×109 cells/pellet) were suspended in buffer containing 20 mM HEPES (4-(...
US Patent US10166249 (2019)
BindingDB Entry DOI: 10.7270/Q2S75JCM
Sphingosine-1-phosphate lyase 1
(Homo sapiens (Human))
BDBM65114
(US10166249, Example 474 | US9522888, 474)
Show SMILES Cc1ccc(COC[C@@H]2CCc3cc(ccc3C2)[C@H]2CC[C@](N)(COP(O)(O)=O)C2)cc1 |r|
Show InChI InChI=1S/C25H34NO5P/c1-18-2-4-19(5-3-18)15-30-16-20-6-7-22-13-23(9-8-21(22)12-20)24-10-11-25(26,14-24)17-31-32(27,28)29/h2-5,8-9,13,20,24H,6-7,10-12,14-17,26H2,1H3,(H2,27,28,29)/t20-,24+,25-/m1/s1
US Patent
n/an/an/an/a 55n/an/an/an/a
Bristol-Myers Squibb Company
US Patent
Assay Description
Compounds were loaded in a 384 Falcon v-bottom plate (0.5 l/well in a 11 point, 3-fold dilution). Membranes prepared from S1P1/CHO cells or EDG3-Gal5...
US Patent US10166249 (2019)
BindingDB Entry DOI: 10.7270/Q2S75JCM
Sphingosine-1-phosphate lyase 1
(Homo sapiens (Human))
BDBM65114
(US10166249, Example 474 | US9522888, 474)
Show SMILES Cc1ccc(COC[C@@H]2CCc3cc(ccc3C2)[C@H]2CC[C@](N)(COP(O)(O)=O)C2)cc1 |r|
Show InChI InChI=1S/C25H34NO5P/c1-18-2-4-19(5-3-18)15-30-16-20-6-7-22-13-23(9-8-21(22)12-20)24-10-11-25(26,14-24)17-31-32(27,28)29/h2-5,8-9,13,20,24H,6-7,10-12,14-17,26H2,1H3,(H2,27,28,29)/t20-,24+,25-/m1/s1
US Patent
n/an/an/an/a<10n/an/an/an/a
Bristol-Myers Squibb Company
US Patent
Assay Description
hS1P1/CHO cells were plated into BD Amine 384-well plates the day before the assay. On the day of the assay, growth medium was removed and replaced w...
US Patent US10166249 (2019)
BindingDB Entry DOI: 10.7270/Q2S75JCM
Sphingosine 1-phosphate receptor 3
(Homo sapiens (Human))
BDBM65114
(US10166249, Example 474 | US9522888, 474)
Show SMILES Cc1ccc(COC[C@@H]2CCc3cc(ccc3C2)[C@H]2CC[C@](N)(COP(O)(O)=O)C2)cc1 |r|
Show InChI InChI=1S/C25H34NO5P/c1-18-2-4-19(5-3-18)15-30-16-20-6-7-22-13-23(9-8-21(22)12-20)24-10-11-25(26,14-24)17-31-32(27,28)29/h2-5,8-9,13,20,24H,6-7,10-12,14-17,26H2,1H3,(H2,27,28,29)/t20-,24+,25-/m1/s1
NCI pathway
Reactome pathway
US Patent
n/an/an/an/a>625n/an/an/a60
Bristol-Myers Squibb Company
US Patent
Assay Description
Compounds were loaded in a 384 Falcon v-bottom plate (0.5 ul/well in a 11 point, 3-fold dilution). Membranes prepared from S1P1/CHO cells or EDG3-Gal...
US Patent US9522888 (2016)
BindingDB Entry DOI: 10.7270/Q20K27HV