null
SMILES: CC(C)CC(NC(=O)c1ccc(Cl)cc1)C(=O)OCC(=O)c1ccc2OCC(=O)Nc2c1
InChI Key: InChIKey=DQKXQKDNAJLVID-UHFFFAOYSA-N
Activity Spreadsheet -- Enzyme Inhibition Constant Data from BindingDB
Found 4 hits for monomerid = 66374
Trg + Lig
Ki
nM
ΔG°
kcal/mole
IC50
nM
Kd
nM
EC50/IC50
nM
koff
s-1
kon
M-1s-1
pHTemp
°C
Bcl-2-like protein 11
(Homo sapiens (Human))
BDBM66374
(2-[(4-chlorobenzoyl)amino]-4-methyl-valeric acid [...)
Show SMILES CC(C)CC(NC(=O)c1ccc(Cl)cc1)C(=O)OCC(=O)c1ccc2OCC(=O)Nc2c1
Show InChI InChI=1S/C23H23ClN2O6/c1-13(2)9-18(26-22(29)14-3-6-16(24)7-4-14)23(30)32-11-19(27)15-5-8-20-17(10-15)25-21(28)12-31-20/h3-8,10,13,18H,9,11-12H2,1-2H3,(H,25,28)(H,26,29)
Reactome pathway
PCBioAssay
n/an/an/an/a 5.35E+3n/an/an/an/a
Broad Institute
Curated by PubChem BioAssay
Assay Description
Keywords: apoptosis, BH3 domain, Bcl2-A1, BIM, caspase, cancer Primary Collaborator: Todd Golub, Broad Institute, golub@broadinstitute.org Assay Over...
PubChem Bioassay (2010)
BindingDB Entry DOI: 10.7270/Q24J0CKJ
DNA damage-inducible transcript 3 protein
(Mus musculus)
BDBM66374
(2-[(4-chlorobenzoyl)amino]-4-methyl-valeric acid [...)
Show SMILES CC(C)CC(NC(=O)c1ccc(Cl)cc1)C(=O)OCC(=O)c1ccc2OCC(=O)Nc2c1
Show InChI InChI=1S/C23H23ClN2O6/c1-13(2)9-18(26-22(29)14-3-6-16(24)7-4-14)23(30)32-11-19(27)15-5-8-20-17(10-15)25-21(28)12-31-20/h3-8,10,13,18H,9,11-12H2,1-2H3,(H,25,28)(H,26,29)
PCBioAssay
n/an/a 1.17E+3n/an/an/an/an/an/a
Emory University Molecular Libraries Screening Center
Curated by PubChem BioAssay
Assay Description
NIH Molecular Libraries Screening Centers Network [MLSCN] Emory Chemical Biology Discovery Center in MLSCN Assay provider: Dr. Randal Kaufman, Univer...
PubChem Bioassay (2011)
BindingDB Entry DOI: 10.7270/Q28C9TQN
X-box-binding protein 1
(Homo sapiens (Human))
BDBM66374
(2-[(4-chlorobenzoyl)amino]-4-methyl-valeric acid [...)
Show SMILES CC(C)CC(NC(=O)c1ccc(Cl)cc1)C(=O)OCC(=O)c1ccc2OCC(=O)Nc2c1
Show InChI InChI=1S/C23H23ClN2O6/c1-13(2)9-18(26-22(29)14-3-6-16(24)7-4-14)23(30)32-11-19(27)15-5-8-20-17(10-15)25-21(28)12-31-20/h3-8,10,13,18H,9,11-12H2,1-2H3,(H,25,28)(H,26,29)
PCBioAssay
n/an/a 5.11E+3n/an/an/an/an/an/a
Emory University Molecular Libraries Screening Center
Curated by PubChem BioAssay
Assay Description
NIH Molecular Libraries Screening Centers Network [MLSCN] Emory Chemical Biology Discovery Center in MLSCN Assay provider: Dr. Randal Kaufman, Univer...
PubChem Bioassay (2011)
BindingDB Entry DOI: 10.7270/Q2NK3CGB
DNA damage-inducible transcript 3 protein
(Mus musculus)
BDBM66374
(2-[(4-chlorobenzoyl)amino]-4-methyl-valeric acid [...)
Show SMILES CC(C)CC(NC(=O)c1ccc(Cl)cc1)C(=O)OCC(=O)c1ccc2OCC(=O)Nc2c1
Show InChI InChI=1S/C23H23ClN2O6/c1-13(2)9-18(26-22(29)14-3-6-16(24)7-4-14)23(30)32-11-19(27)15-5-8-20-17(10-15)25-21(28)12-31-20/h3-8,10,13,18H,9,11-12H2,1-2H3,(H,25,28)(H,26,29)
PCBioAssay
n/an/a 1.17E+3n/an/an/an/an/an/a
Emory University Molecular Libraries Screening Center
Curated by PubChem BioAssay
Assay Description
NIH Molecular Libraries Screening Centers Network [MLSCN] Emory Chemical Biology Discovery Center in MLSCN Assay provider: Dr. Randal Kaufman, Univer...
PubChem Bioassay (2010)
BindingDB Entry DOI: 10.7270/Q2PC30VZ