BDBM70210 N-[1-[3-(4-tert-butylphenyl)-1,2,4-oxadiazol-5-yl]ethyl]benzamide::SR-03000001327::SR-03000001327-1::cid_6457923
SMILES: CC(NC(=O)c1ccccc1)c1nc(no1)-c1ccc(cc1)C(C)(C)C
InChI Key: InChIKey=AEGVGQYNOULHPX-UHFFFAOYSA-N
Data: 1 IC50
Activity Spreadsheet -- Enzyme Inhibition Constant Data from BindingDB
Found 1 hit for monomerid = 70210
Trg + Lig
Ki
nM
ΔG°
kcal/mole
IC50
nM
Kd
nM
EC50/IC50
nM
koff
s-1
kon
M-1s-1
pHTemp
°C
Krueppel-like factor 5
(Homo sapiens (Human))
BDBM70210
(N-[1-[3-(4-tert-butylphenyl)-1,2,4-oxadiazol-5-yl]...)
Show SMILES CC(NC(=O)c1ccccc1)c1nc(no1)-c1ccc(cc1)C(C)(C)C
Show InChI InChI=1S/C21H23N3O2/c1-14(22-19(25)16-8-6-5-7-9-16)20-23-18(24-26-20)15-10-12-17(13-11-15)21(2,3)4/h5-14H,1-4H3,(H,22,25)
Reactome pathway
PCBioAssay
n/an/a>3.98E+4n/an/an/an/an/an/a
The Scripps Research Institute Molecular Screening Center
Curated by PubChem BioAssay
Assay Description
Source (MLPCN Center Name): The Scripps Research Institute Molecular Screening Center Affiliation: The Scripps Research Institute, TSRI Assay Provide...
PubChem Bioassay (2010)
BindingDB Entry DOI: 10.7270/Q2Q52N2C