BDBM7037 (4R,5S,6S,7R)-1,3-dibenzyl-5,6-dihydroxy-4,7-bis({[4-(methylsulfanyl)phenyl]methyl})-1,3-diazepan-2-one::(4R,5S,6S,7R)-Hexahydro-5,6-dihydroxy-1,3-bis-(phenylmethyl)-4,7-bis[[4-(methylthio)phenyl]methyl]-2H-1,3-diazapin-2-one::Substituted Cyclic Urea 25
SMILES: CSc1ccc(C[C@@H]2[C@H](O)[C@@H](O)[C@@H](Cc3ccc(SC)cc3)N(Cc3ccccc3)C(=O)N2Cc2ccccc2)cc1
InChI Key: InChIKey=BZDQGKJBMUHQGC-WZJLIZBTSA-N
Data: 1 KI
Activity Spreadsheet -- Enzyme Inhibition Constant Data from BindingDB
Found 1 hit for monomerid = 7037
Trg + Lig
Ki
nM
ΔG°
kcal/mole
IC50
nM
Kd
nM
EC50/IC50
nM
koff
s-1
kon
M-1s-1
pHTemp
°C
HIV-1 Protease
(Human immunodeficiency virus type 1)
BDBM7037
((4R,5S,6S,7R)-1,3-dibenzyl-5,6-dihydroxy-4,7-bis({...)
Show SMILES CSc1ccc(C[C@@H]2[C@H](O)[C@@H](O)[C@@H](Cc3ccc(SC)cc3)N(Cc3ccccc3)C(=O)N2Cc2ccccc2)cc1
Show InChI InChI=1S/C35H38N2O3S2/c1-41-29-17-13-25(14-18-29)21-31-33(38)34(39)32(22-26-15-19-30(42-2)20-16-26)37(24-28-11-7-4-8-12-28)35(40)36(31)23-27-9-5-3-6-10-27/h3-20,31-34,38-39H,21-24H2,1-2H3/t31-,32-,33+,34+/m1/s1
3.40 -12.0n/an/an/an/an/a5.537
DuPont Merck Pharmaceutical Company
Assay Description
Inhibition of HIV protease was measured by assay of the cleavage of a fluorescent peptide substrate. The fluorescent product (2-aminobenzoyl-Ala-Thr-...
J Med Chem 39: 2156-69 (1996)
Article DOI: 10.1021/jm960083n
BindingDB Entry DOI: 10.7270/Q257197T