null
SMILES: N#Cc1cc(Oc2cccc3cccnc23)c(cc1C#N)-n1nnc2ccccc12
InChI Key: InChIKey=CIVUIMKTBGAJBH-UHFFFAOYSA-N
Activity Spreadsheet -- Enzyme Inhibition Constant Data from BindingDB
Found 2 hits for monomerid = 71687
Trg + Lig
Ki
nM
ΔG°
kcal/mole
IC50
nM
Kd
nM
EC50/IC50
nM
koff
s-1
kon
M-1s-1
pHTemp
°C
Orotidine 5'-phosphate decarboxylase
(Aspergillus niger)
BDBM71687
(4-(1-benzotriazolyl)-5-(8-quinolinyloxy)benzene-1,...)
Show SMILES N#Cc1cc(Oc2cccc3cccnc23)c(cc1C#N)-n1nnc2ccccc12
Show InChI InChI=1S/C23H12N6O/c24-13-16-11-20(29-19-8-2-1-7-18(19)27-28-29)22(12-17(16)14-25)30-21-9-3-5-15-6-4-10-26-23(15)21/h1-12H
PCBioAssay
n/an/an/an/a>5.96E+4n/an/an/an/a
The Scripps Research Institute Molecular Screening Center
Curated by PubChem BioAssay
Assay Description
Source (MLPCN Center Name): The Scripps Research Institute Molecular Screening Center (SRISMC) Center Affiliation: The Scripps Research Institute, TS...
PubChem Bioassay (2011)
BindingDB Entry DOI: 10.7270/Q2PK0DN5
Heat shock factor protein 1
(Mus musculus)
BDBM71687
(4-(1-benzotriazolyl)-5-(8-quinolinyloxy)benzene-1,...)
Show SMILES N#Cc1cc(Oc2cccc3cccnc23)c(cc1C#N)-n1nnc2ccccc12
Show InChI InChI=1S/C23H12N6O/c24-13-16-11-20(29-19-8-2-1-7-18(19)27-28-29)22(12-17(16)14-25)30-21-9-3-5-15-6-4-10-26-23(15)21/h1-12H
PCBioAssay
n/an/an/an/a>2.60E+5n/an/an/an/a
Broad Institute
Curated by PubChem BioAssay
Assay Description
Keywords: Heat Shock Factor-1 (HSF-1), Stress Response, MG132, NIH3T3, Luminescence Assay Overview: Confirmation testing of small molecules identifie...
PubChem Bioassay (2010)
BindingDB Entry DOI: 10.7270/Q2P55KXK