BDBM7242 (3Z)-2-oxo-3-({4-oxo-2H,4H,6H,7H-pyrano[3,4-c]pyrrol-1-yl}methylidene)-N-(propan-2-yl)-2,3-dihydro-1H-indole-5-sulfonamide::pyrrollylactone indolinone driv. 15d
SMILES: CC(C)NS(=O)(=O)c1ccc2NC(=O)\C(=C/c3[nH]cc4c3CCOC4=O)c2c1
InChI Key: InChIKey=FNZUUGCKBYLYMM-ZSOIEALJSA-N
Data: 4 IC50
Activity Spreadsheet -- Enzyme Inhibition Constant Data from BindingDB
Found 4 hits for monomerid = 7242
Trg + Lig
Ki
nM
ΔG°
kcal/mole
IC50
nM
Kd
nM
EC50/IC50
nM
koff
s-1
kon
M-1s-1
pHTemp
°C
CDK2/CycE
(Homo sapiens (Human))
BDBM7242
((3Z)-2-oxo-3-({4-oxo-2H,4H,6H,7H-pyrano[3,4-c]pyrr...)
Show SMILES CC(C)NS(=O)(=O)c1ccc2NC(=O)\C(=C/c3[nH]cc4c3CCOC4=O)c2c1
Show InChI InChI=1S/C19H19N3O5S/c1-10(2)22-28(25,26)11-3-4-16-13(7-11)14(18(23)21-16)8-17-12-5-6-27-19(24)15(12)9-20-17/h3-4,7-10,20,22H,5-6H2,1-2H3,(H,21,23)/b14-8-
n/an/a 64n/an/an/an/a7.422
SUGEN, Inc.
Assay Description
For the assay, purified cdk/cyclin was added to polystyrene 96-well plates that were precoated with GST-Rb substrate in the presence of ATP. After i...
Bioorg Med Chem Lett 13: 1939-42 (2003)
Article DOI: 10.1016/s0960-894x(03)00312-3
BindingDB Entry DOI: 10.7270/Q2HD7SW7
Proto-oncogene tyrosine-protein kinase Src
(Homo sapiens (Human))
BDBM7242
((3Z)-2-oxo-3-({4-oxo-2H,4H,6H,7H-pyrano[3,4-c]pyrr...)
Show SMILES CC(C)NS(=O)(=O)c1ccc2NC(=O)\C(=C/c3[nH]cc4c3CCOC4=O)c2c1
Show InChI InChI=1S/C19H19N3O5S/c1-10(2)22-28(25,26)11-3-4-16-13(7-11)14(18(23)21-16)8-17-12-5-6-27-19(24)15(12)9-20-17/h3-4,7-10,20,22H,5-6H2,1-2H3,(H,21,23)/b14-8-
n/an/a>2.00E+4n/an/an/an/an/a25
SUGEN, Inc.
Assay Description
The assays were performed in 96-well microtiter plates that had been coated with a polyGluTyr peptide. Negative control wells received buffer alone w...
Bioorg Med Chem Lett 13: 1939-42 (2003)
Article DOI: 10.1016/s0960-894x(03)00312-3
BindingDB Entry DOI: 10.7270/Q2HD7SW7
Platelet-derived growth factor receptor beta
(Homo sapiens (Human))
BDBM7242
((3Z)-2-oxo-3-({4-oxo-2H,4H,6H,7H-pyrano[3,4-c]pyrr...)
Show SMILES CC(C)NS(=O)(=O)c1ccc2NC(=O)\C(=C/c3[nH]cc4c3CCOC4=O)c2c1
Show InChI InChI=1S/C19H19N3O5S/c1-10(2)22-28(25,26)11-3-4-16-13(7-11)14(18(23)21-16)8-17-12-5-6-27-19(24)15(12)9-20-17/h3-4,7-10,20,22H,5-6H2,1-2H3,(H,21,23)/b14-8-
NCI pathway
Reactome pathway
n/an/a>2.00E+4n/an/an/an/an/a25
SUGEN, Inc.
Assay Description
IC50 is the inhibitor concentration which inhibits 50% of PDGFR-beta kinase autophosphorylation activity. The assay was performed in 96-well microtit...
Bioorg Med Chem Lett 13: 1939-42 (2003)
Article DOI: 10.1016/s0960-894x(03)00312-3
BindingDB Entry DOI: 10.7270/Q2HD7SW7
Vascular endothelial growth factor receptor 2
(Homo sapiens (Human))
BDBM7242
((3Z)-2-oxo-3-({4-oxo-2H,4H,6H,7H-pyrano[3,4-c]pyrr...)
Show SMILES CC(C)NS(=O)(=O)c1ccc2NC(=O)\C(=C/c3[nH]cc4c3CCOC4=O)c2c1
Show InChI InChI=1S/C19H19N3O5S/c1-10(2)22-28(25,26)11-3-4-16-13(7-11)14(18(23)21-16)8-17-12-5-6-27-19(24)15(12)9-20-17/h3-4,7-10,20,22H,5-6H2,1-2H3,(H,21,23)/b14-8-
NCI pathway
Reactome pathway
n/an/a 6.70E+3n/an/an/an/an/a25
SUGEN, Inc.
Assay Description
The assays were performed in 96-well microtiter plates that had been coated with a polyGluTyr peptide. Negative control wells received buffer alone w...
Bioorg Med Chem Lett 13: 1939-42 (2003)
Article DOI: 10.1016/s0960-894x(03)00312-3
BindingDB Entry DOI: 10.7270/Q2HD7SW7