null
SMILES: COc1ccc(cc1)-c1[nH]c2nccnc2c1CC=C
InChI Key: InChIKey=RYNPAHUWYURCCW-UHFFFAOYSA-N
Activity Spreadsheet -- Enzyme Inhibition Constant Data from BindingDB
Found 4 hits for monomerid = 7363
Trg + Lig
Ki
nM
ΔG°
kcal/mole
IC50
nM
Kd
nM
EC50/IC50
nM
koff
s-1
kon
M-1s-1
pHTemp
°C
Cyclin-dependent kinase 5 activator 1 [99-307]
(Homo sapiens (Human))
BDBM7363
(6-(4-methoxyphenyl)-7-(prop-2-en-1-yl)-5H-pyrrolo[...)
Show SMILES COc1ccc(cc1)-c1[nH]c2nccnc2c1CC=C
Show InChI InChI=1S/C16H15N3O/c1-3-4-13-14(11-5-7-12(20-2)8-6-11)19-16-15(13)17-9-10-18-16/h3,5-10H,1,4H2,2H3,(H,18,19)
NCI pathway
Reactome pathway
n/an/a 2.00E+3n/an/an/an/an/a30
Faculte de Medecine et de Pharmacie
Assay Description
Kinase activities were assayed in buffers containing substrate, enzyme, and inhibitor at 30 °C in the presence of 15 uM ATP/ [gamma-32P] ATP. 32...
J Med Chem 46: 222-36 (2003)
Article DOI: 10.1021/jm020319p
BindingDB Entry DOI: 10.7270/Q2474820
Glycogen synthase kinase-3 alpha/beta
(Homo sapiens (Human))
BDBM7363
(6-(4-methoxyphenyl)-7-(prop-2-en-1-yl)-5H-pyrrolo[...)
Show SMILES COc1ccc(cc1)-c1[nH]c2nccnc2c1CC=C
Show InChI InChI=1S/C16H15N3O/c1-3-4-13-14(11-5-7-12(20-2)8-6-11)19-16-15(13)17-9-10-18-16/h3,5-10H,1,4H2,2H3,(H,18,19)
n/an/a 603n/an/an/an/an/an/a
Zhejiang University
Curated by ChEMBL
Assay Description
Inhibitory concentration against Glycogen synthase kinase-3
Bioorg Med Chem Lett 15: 395-9 (2005)
Article DOI: 10.1016/j.bmcl.2004.10.060
BindingDB Entry DOI: 10.7270/Q2WH2SR0
Cyclin-dependent kinase 1/G2/mitotic-specific cyclin-B
(Marthasterias glacialis (starfish))
BDBM7363
(6-(4-methoxyphenyl)-7-(prop-2-en-1-yl)-5H-pyrrolo[...)
Show SMILES COc1ccc(cc1)-c1[nH]c2nccnc2c1CC=C
Show InChI InChI=1S/C16H15N3O/c1-3-4-13-14(11-5-7-12(20-2)8-6-11)19-16-15(13)17-9-10-18-16/h3,5-10H,1,4H2,2H3,(H,18,19)
n/an/a 1.00E+3n/an/an/an/an/a30
Faculte de Medecine et de Pharmacie
Assay Description
Kinase activities were assayed in buffers containing substrate, enzyme, and inhibitor at 30 °C in the presence of 15 uM ATP/ [gamma-32P] ATP. 32...
J Med Chem 46: 222-36 (2003)
Article DOI: 10.1021/jm020319p
BindingDB Entry DOI: 10.7270/Q2474820
Glycogen synthase kinase-3 beta
(Rattus norvegicus (rat))
BDBM7363
(6-(4-methoxyphenyl)-7-(prop-2-en-1-yl)-5H-pyrrolo[...)
Show SMILES COc1ccc(cc1)-c1[nH]c2nccnc2c1CC=C
Show InChI InChI=1S/C16H15N3O/c1-3-4-13-14(11-5-7-12(20-2)8-6-11)19-16-15(13)17-9-10-18-16/h3,5-10H,1,4H2,2H3,(H,18,19)
Reactome pathway
n/an/a 600n/an/an/an/an/a30
Faculte de Medecine et de Pharmacie
Assay Description
Kinase activities were assayed in buffers containing substrate, enzyme, and inhibitor at 30 °C in the presence of 15 uM ATP/ [gamma-32P] ATP. 32...
J Med Chem 46: 222-36 (2003)
Article DOI: 10.1021/jm020319p
BindingDB Entry DOI: 10.7270/Q2474820