null
SMILES: CS(=O)(=O)N(CC(=O)N1CCC(CC1)C(N)=O)c1ccc(Oc2ccccc2)cc1
InChI Key: InChIKey=VATJQVNUAJMGHW-UHFFFAOYSA-N
Activity Spreadsheet -- Enzyme Inhibition Constant Data from BindingDB
Found 2 hits for monomerid = 75967
Trg + Lig
Ki
nM
ΔG°
kcal/mole
IC50
nM
Kd
nM
EC50/IC50
nM
koff
s-1
kon
M-1s-1
pHTemp
°C
Photoreceptor-specific nuclear receptor
(Homo sapiens (Human))
BDBM75967
(1-[2-(N-mesyl-4-phenoxy-anilino)acetyl]isonipecota...)
Show SMILES CS(=O)(=O)N(CC(=O)N1CCC(CC1)C(N)=O)c1ccc(Oc2ccccc2)cc1
Show InChI InChI=1S/C21H25N3O5S/c1-30(27,28)24(15-20(25)23-13-11-16(12-14-23)21(22)26)17-7-9-19(10-8-17)29-18-5-3-2-4-6-18/h2-10,16H,11-15H2,1H3,(H2,22,26)
Reactome pathway
PCBioAssay
n/an/a 1.06E+3n/an/an/an/an/an/a
The Scripps Research Institute Molecular Screening Center
Curated by PubChem BioAssay
Assay Description
Source (MLPCN Center Name): The Scripps Research Institute Molecular Screening Center Affiliation: The Scripps Research Institute, TSRI Assay Provide...
PubChem Bioassay (2010)
BindingDB Entry DOI: 10.7270/Q2BK19S0
Isoform 2 of Nuclear receptor corepressor 2 (TRAC-1)
(Homo sapiens (Human))
BDBM75967
(1-[2-(N-mesyl-4-phenoxy-anilino)acetyl]isonipecota...)
Show SMILES CS(=O)(=O)N(CC(=O)N1CCC(CC1)C(N)=O)c1ccc(Oc2ccccc2)cc1
Show InChI InChI=1S/C21H25N3O5S/c1-30(27,28)24(15-20(25)23-13-11-16(12-14-23)21(22)26)17-7-9-19(10-8-17)29-18-5-3-2-4-6-18/h2-10,16H,11-15H2,1H3,(H2,22,26)
PCBioAssay
n/an/a 792n/an/an/an/an/an/a
The Scripps Research Institute Molecular Screening Center
Curated by PubChem BioAssay
Assay Description
Source (MLPCN Center Name): The Scripps Research Institute Molecular Screening Center Affiliation: The Scripps Research Institute, TSRI Assay Provide...
PubChem Bioassay (2010)
BindingDB Entry DOI: 10.7270/Q26T0K34