null
SMILES: [O-][N+](=O)c1ccc([CH+][N-]n2c(n[nH]c2=S)-c2cccnc2)cc1
InChI Key: InChIKey=GVJYTWHIOKWMLI-UHFFFAOYSA-N
Activity Spreadsheet -- Enzyme Inhibition Constant Data from BindingDB
Found 2 hits for monomerid = 80180
Trg + Lig
Ki
nM
ΔG°
kcal/mole
IC50
nM
Kd
nM
EC50/IC50
nM
koff
s-1
kon
M-1s-1
pHTemp
°C
DNA dC->dU-editing enzyme APOBEC-3A
(Homo sapiens (Human))
BDBM80180
(4-[(4-nitrobenzylidene)amino]-3-(3-pyridyl)-1H-1,2...)
Show SMILES [O-][N+](=O)c1ccc([CH+][N-]n2c(n[nH]c2=S)-c2cccnc2)cc1
Show InChI InChI=1S/C14H10N6O2S/c21-20(22)12-5-3-10(4-6-12)8-16-19-13(17-18-14(19)23)11-2-1-7-15-9-11/h1-9H,(H,18,23)
PCBioAssay
n/an/a>1.00E+5n/an/an/an/an/a25
Burnham Center for Chemical Genomics
Curated by PubChem BioAssay
Assay Description
Data Source: Sanford-Burnham Center for Chemical Genomics (SBCCG) Source Affiliation: Sanford-Burnham Medical Research Institute (SBMRI, San Diego, C...
PubChem Bioassay (2011)
BindingDB Entry DOI: 10.7270/Q2CZ35ND
DNA dC->dU-editing enzyme APOBEC-3G
(Homo sapiens (Human))
BDBM80180
(4-[(4-nitrobenzylidene)amino]-3-(3-pyridyl)-1H-1,2...)
Show SMILES [O-][N+](=O)c1ccc([CH+][N-]n2c(n[nH]c2=S)-c2cccnc2)cc1
Show InChI InChI=1S/C14H10N6O2S/c21-20(22)12-5-3-10(4-6-12)8-16-19-13(17-18-14(19)23)11-2-1-7-15-9-11/h1-9H,(H,18,23)
PCBioAssay
n/an/a 2.30E+3n/an/an/an/an/a25
Burnham Center for Chemical Genomics
Curated by PubChem BioAssay
Assay Description
Data Source: Sanford-Burnham Center for Chemical Genomics (SBCCG) Source Affiliation: Sanford-Burnham Medical Research Institute (SBMRI, San Diego, C...
PubChem Bioassay (2011)
BindingDB Entry DOI: 10.7270/Q2HQ3XD6