null
SMILES: Cc1ccsc1C=Nn1c(n[nH]c1=S)-c1ccncc1
InChI Key: InChIKey=PLGDSQNTFRUOQS-OVCLIPMQSA-N
Activity Spreadsheet -- Enzyme Inhibition Constant Data from BindingDB
Found 2 hits for monomerid = 80196
Trg + Lig
Ki
nM
ΔG°
kcal/mole
IC50
nM
Kd
nM
EC50/IC50
nM
koff
s-1
kon
M-1s-1
pHTemp
°C
DNA dC->dU-editing enzyme APOBEC-3A
(Homo sapiens (Human))
BDBM80196
(4-[(3-methyl-2-thienyl)methyleneamino]-3-(4-pyridy...)
Show SMILES Cc1ccsc1C=Nn1c(n[nH]c1=S)-c1ccncc1 |w:7.8|
Show InChI InChI=1S/C13H11N5S2/c1-9-4-7-20-11(9)8-15-18-12(16-17-13(18)19)10-2-5-14-6-3-10/h2-8H,1H3,(H,17,19)/b15-8+
PCBioAssay
n/an/a>1.00E+5n/an/an/an/an/a25
Burnham Center for Chemical Genomics
Curated by PubChem BioAssay
Assay Description
Data Source: Sanford-Burnham Center for Chemical Genomics (SBCCG) Source Affiliation: Sanford-Burnham Medical Research Institute (SBMRI, San Diego, C...
PubChem Bioassay (2011)
BindingDB Entry DOI: 10.7270/Q2CZ35ND
DNA dC->dU-editing enzyme APOBEC-3G
(Homo sapiens (Human))
BDBM80196
(4-[(3-methyl-2-thienyl)methyleneamino]-3-(4-pyridy...)
Show SMILES Cc1ccsc1C=Nn1c(n[nH]c1=S)-c1ccncc1 |w:7.8|
Show InChI InChI=1S/C13H11N5S2/c1-9-4-7-20-11(9)8-15-18-12(16-17-13(18)19)10-2-5-14-6-3-10/h2-8H,1H3,(H,17,19)/b15-8+
PCBioAssay
n/an/a 2.45E+3n/an/an/an/an/a25
Burnham Center for Chemical Genomics
Curated by PubChem BioAssay
Assay Description
Data Source: Sanford-Burnham Center for Chemical Genomics (SBCCG) Source Affiliation: Sanford-Burnham Medical Research Institute (SBMRI, San Diego, C...
PubChem Bioassay (2011)
BindingDB Entry DOI: 10.7270/Q2HQ3XD6