BDBM81275 7-(dimethylamino)-3-phenothiazinone::7-(dimethylamino)phenothiazin-3-one::MLS003106970::SMR001490544::cid_73024
SMILES: CN(C)c1ccc2nc3ccc(=O)cc3sc2c1
InChI Key: InChIKey=ALJHHTHBYJROOG-UHFFFAOYSA-N
Data: 2 IC50
Activity Spreadsheet -- Enzyme Inhibition Constant Data from BindingDB
Found 2 hits for monomerid = 81275
Trg + Lig
Ki
nM
ΔG°
kcal/mole
IC50
nM
Kd
nM
EC50/IC50
nM
koff
s-1
kon
M-1s-1
pHTemp
°C
PC4 and SFRS1-interacting protein
(Homo sapiens (Human))
BDBM81275
(7-(dimethylamino)-3-phenothiazinone | 7-(dimethyla...)
Show SMILES CN(C)c1ccc2nc3ccc(=O)cc3sc2c1
Show InChI InChI=1S/C14H12N2OS/c1-16(2)9-3-5-11-13(7-9)18-14-8-10(17)4-6-12(14)15-11/h3-8H,1-2H3
Reactome pathway
PCBioAssay
n/an/a 3.65E+4n/an/an/an/an/an/a
The Scripps Research Institute Molecular Screening Center
Curated by PubChem BioAssay
Assay Description
Source (MLPCN Center Name): The Scripps Research Institute Molecular Screening Center (SRIMSC) Affiliation: Ohio State University Assay Provider: Mam...
PubChem Bioassay (2014)
BindingDB Entry DOI: 10.7270/Q2KD1WKS
PC4 and SFRS1-interacting protein
(Homo sapiens (Human))
BDBM81275
(7-(dimethylamino)-3-phenothiazinone | 7-(dimethyla...)
Show SMILES CN(C)c1ccc2nc3ccc(=O)cc3sc2c1
Show InChI InChI=1S/C14H12N2OS/c1-16(2)9-3-5-11-13(7-9)18-14-8-10(17)4-6-12(14)15-11/h3-8H,1-2H3
Reactome pathway
PCBioAssay
n/an/a 2.86E+3n/an/an/an/an/an/a
The Scripps Research Institute Molecular Screening Center
Curated by PubChem BioAssay
Assay Description
Source (MLPCN Center Name): The Scripps Research Institute Molecular Screening Center (SRIMSC) Affiliation: Ohio State University Assay Provider: Mam...
PubChem Bioassay (2014)
BindingDB Entry DOI: 10.7270/Q2Q52N9H