BDBM8130 N-(4-nitrophenyl)-4-{pyrazolo[1,5-a]pyridazin-3-yl}pyrimidin-2-amine::pyrazolo[1,5-b]pyridazine deriv. 21
SMILES: O=N(=O)c1ccc(Nc2nccc(n2)-c2cnn3ncccc23)cc1
InChI Key: InChIKey=RVBOIHXTZQGXRV-UHFFFAOYSA-N
Data: 1 KI  3 IC50
Activity Spreadsheet -- Enzyme Inhibition Constant Data from BindingDB
Found 3 hits for monomerid = 8130
Trg + Lig
Ki
nM
ΔG°
kcal/mole
IC50
nM
Kd
nM
EC50/IC50
nM
koff
s-1
kon
M-1s-1
pHTemp
°C
Glycogen synthase kinase-3 beta
(Homo sapiens (Human))
BDBM8130
(N-(4-nitrophenyl)-4-{pyrazolo[1,5-a]pyridazin-3-yl...)
Show SMILES O=N(=O)c1ccc(Nc2nccc(n2)-c2cnn3ncccc23)cc1
Show InChI InChI=1S/C16H11N7O2/c24-23(25)12-5-3-11(4-6-12)20-16-17-9-7-14(21-16)13-10-19-22-15(13)2-1-8-18-22/h1-10H,(H,17,20,21)
NCI pathway
Reactome pathway
2n/a<10n/an/an/an/an/an/a
GlaxoSmithKline
Assay Description
The biochemical activity of compounds was determined by incubation with specific enzyme and substrate in the presence 2.5 uM ATP/ [gamma-32P] ATP. Af...
J Med Chem 47: 4716-30 (2004)
Article DOI: 10.1021/jm040063i
BindingDB Entry DOI: 10.7270/Q2VM49HJ
Cyclin-Dependent Kinase 4 (CDK4)
(Homo sapiens (Human))
BDBM8130
(N-(4-nitrophenyl)-4-{pyrazolo[1,5-a]pyridazin-3-yl...)
Show SMILES O=N(=O)c1ccc(Nc2nccc(n2)-c2cnn3ncccc23)cc1
Show InChI InChI=1S/C16H11N7O2/c24-23(25)12-5-3-11(4-6-12)20-16-17-9-7-14(21-16)13-10-19-22-15(13)2-1-8-18-22/h1-10H,(H,17,20,21)
NCI pathway
Reactome pathway
n/an/a 25n/an/an/an/an/an/a
GlaxoSmithKline
Assay Description
The biochemical activity of compounds was determined by incubation with specific enzyme and substrate in the presence 2.5 uM ATP/ [gamma-32P] ATP. Af...
J Med Chem 47: 4716-30 (2004)
Article DOI: 10.1021/jm040063i
BindingDB Entry DOI: 10.7270/Q2VM49HJ
Cyclin-Dependent Kinase 2 (CDK2)
(Homo sapiens (Human))
BDBM8130
(N-(4-nitrophenyl)-4-{pyrazolo[1,5-a]pyridazin-3-yl...)
Show SMILES O=N(=O)c1ccc(Nc2nccc(n2)-c2cnn3ncccc23)cc1
Show InChI InChI=1S/C16H11N7O2/c24-23(25)12-5-3-11(4-6-12)20-16-17-9-7-14(21-16)13-10-19-22-15(13)2-1-8-18-22/h1-10H,(H,17,20,21)
NCI pathway
Reactome pathway
n/an/a 22n/an/an/an/a7.222
GlaxoSmithKline
Assay Description
The biochemical activity of compounds was determined by incubation with specific enzyme and substrate in the presence 2.5 uM ATP/ [gamma-32P] ATP. Af...
J Med Chem 47: 4716-30 (2004)
Article DOI: 10.1021/jm040063i
BindingDB Entry DOI: 10.7270/Q2VM49HJ