BDBM8136 N-(2,3-dihydro-1,4-benzodioxin-6-yl)-4-{pyrazolo[1,5-a]pyridazin-3-yl}pyrimidin-2-amine::pyrazolo[1,5-b]pyridazine deriv. 27
SMILES: C1COc2cc(Nc3nccc(n3)-c3cnn4ncccc34)ccc2O1
InChI Key: InChIKey=WIIIHAKKVLVGJX-UHFFFAOYSA-N
Data: 1 KI  6 IC50
Activity Spreadsheet -- Enzyme Inhibition Constant Data from BindingDB
Found 6 hits for monomerid = 8136
Trg + Lig
Ki
nM
ΔG°
kcal/mole
IC50
nM
Kd
nM
EC50/IC50
nM
koff
s-1
kon
M-1s-1
pHTemp
°C
Glycogen synthase kinase-3 beta
(Homo sapiens (Human))
BDBM8136
(N-(2,3-dihydro-1,4-benzodioxin-6-yl)-4-{pyrazolo[1...)
Show SMILES C1COc2cc(Nc3nccc(n3)-c3cnn4ncccc34)ccc2O1
Show InChI InChI=1S/C18H14N6O2/c1-2-15-13(11-21-24(15)20-6-1)14-5-7-19-18(23-14)22-12-3-4-16-17(10-12)26-9-8-25-16/h1-7,10-11H,8-9H2,(H,19,22,23)
NCI pathway
Reactome pathway
1n/a<10n/an/an/an/an/an/a
GlaxoSmithKline
Assay Description
The biochemical activity of compounds was determined by incubation with specific enzyme and substrate in the presence 2.5 uM ATP/ [gamma-32P] ATP. Af...
J Med Chem 47: 4716-30 (2004)
Article DOI: 10.1021/jm040063i
BindingDB Entry DOI: 10.7270/Q2VM49HJ
Cyclin-dependent kinase 4
(Homo sapiens (Human))
BDBM8136
(N-(2,3-dihydro-1,4-benzodioxin-6-yl)-4-{pyrazolo[1...)
Show SMILES C1COc2cc(Nc3nccc(n3)-c3cnn4ncccc34)ccc2O1
Show InChI InChI=1S/C18H14N6O2/c1-2-15-13(11-21-24(15)20-6-1)14-5-7-19-18(23-14)22-12-3-4-16-17(10-12)26-9-8-25-16/h1-7,10-11H,8-9H2,(H,19,22,23)
NCI pathway
Reactome pathway
n/an/a 316n/an/an/an/an/an/a
Northeastern University
Curated by ChEMBL
Assay Description
Inhibition of human CDK4 using biotinylated-aminohexyl-Ala-Ala-Ala-Lys-Arg-Arg-Glu-Ile-Leu-Ser-Arg-Arg-Pro-Ser(PO3)-Tyr-Arg-amide as substrate after ...
J Med Chem 63: 756-783 (2020)
Article DOI: 10.1021/acs.jmedchem.9b01741
Cyclin-dependent kinase 2
(Homo sapiens (Human))
BDBM8136
(N-(2,3-dihydro-1,4-benzodioxin-6-yl)-4-{pyrazolo[1...)
Show SMILES C1COc2cc(Nc3nccc(n3)-c3cnn4ncccc34)ccc2O1
Show InChI InChI=1S/C18H14N6O2/c1-2-15-13(11-21-24(15)20-6-1)14-5-7-19-18(23-14)22-12-3-4-16-17(10-12)26-9-8-25-16/h1-7,10-11H,8-9H2,(H,19,22,23)
NCI pathway
Reactome pathway
n/an/a 6.30n/an/an/an/an/an/a
Northeastern University
Curated by ChEMBL
Assay Description
Inhibition of human CDK2 using biotinylated-aminohexyl-Ala-Ala-Ala-Lys-Arg-Arg-Glu-Ile-Leu-Ser-Arg-Arg-Pro-Ser(PO3)-Tyr-Arg-amide as substrate after ...
J Med Chem 63: 756-783 (2020)
Article DOI: 10.1021/acs.jmedchem.9b01741
Glycogen synthase kinase-3 beta
(Homo sapiens (Human))
BDBM8136
(N-(2,3-dihydro-1,4-benzodioxin-6-yl)-4-{pyrazolo[1...)
Show SMILES C1COc2cc(Nc3nccc(n3)-c3cnn4ncccc34)ccc2O1
Show InChI InChI=1S/C18H14N6O2/c1-2-15-13(11-21-24(15)20-6-1)14-5-7-19-18(23-14)22-12-3-4-16-17(10-12)26-9-8-25-16/h1-7,10-11H,8-9H2,(H,19,22,23)
NCI pathway
Reactome pathway
n/an/a 1n/an/an/an/an/an/a
Northeastern University
Curated by ChEMBL
Assay Description
Inhibition of human GSK3beta using biotinylated-aminohexyl-Ala-Ala-Ala-Lys-Arg-Arg-Glu-Ile-Leu-Ser-Arg-Arg-Pro-Ser(PO3)-Tyr-Arg-amide as substrate af...
J Med Chem 63: 756-783 (2020)
Article DOI: 10.1021/acs.jmedchem.9b01741
Cyclin-Dependent Kinase 2 (CDK2)
(Homo sapiens (Human))
BDBM8136
(N-(2,3-dihydro-1,4-benzodioxin-6-yl)-4-{pyrazolo[1...)
Show SMILES C1COc2cc(Nc3nccc(n3)-c3cnn4ncccc34)ccc2O1
Show InChI InChI=1S/C18H14N6O2/c1-2-15-13(11-21-24(15)20-6-1)14-5-7-19-18(23-14)22-12-3-4-16-17(10-12)26-9-8-25-16/h1-7,10-11H,8-9H2,(H,19,22,23)
NCI pathway
Reactome pathway
n/an/a 6n/an/an/an/a7.222
GlaxoSmithKline
Assay Description
The biochemical activity of compounds was determined by incubation with specific enzyme and substrate in the presence 2.5 uM ATP/ [gamma-32P] ATP. Af...
J Med Chem 47: 4716-30 (2004)
Article DOI: 10.1021/jm040063i
BindingDB Entry DOI: 10.7270/Q2VM49HJ
Cyclin-Dependent Kinase 4 (CDK4)
(Homo sapiens (Human))
BDBM8136
(N-(2,3-dihydro-1,4-benzodioxin-6-yl)-4-{pyrazolo[1...)
Show SMILES C1COc2cc(Nc3nccc(n3)-c3cnn4ncccc34)ccc2O1
Show InChI InChI=1S/C18H14N6O2/c1-2-15-13(11-21-24(15)20-6-1)14-5-7-19-18(23-14)22-12-3-4-16-17(10-12)26-9-8-25-16/h1-7,10-11H,8-9H2,(H,19,22,23)
NCI pathway
Reactome pathway
n/an/a 15n/an/an/an/an/an/a
GlaxoSmithKline
Assay Description
The biochemical activity of compounds was determined by incubation with specific enzyme and substrate in the presence 2.5 uM ATP/ [gamma-32P] ATP. Af...
J Med Chem 47: 4716-30 (2004)
Article DOI: 10.1021/jm040063i
BindingDB Entry DOI: 10.7270/Q2VM49HJ