BDBM81511 VEA-260
SMILES: OC(=O)c1cccc(c1)C(=O)NCc1ccc(cc1)C(=O)NNC(=O)[C@H]1O[C@@H]1C(=O)N(Cc1cccc2ccccc12)Cc1cccc2ccccc12
InChI Key: InChIKey=ADDMSYZAHVOJKO-BCRBLDSWSA-N
Data: 4 IC50
Activity Spreadsheet -- Enzyme Inhibition Constant Data from BindingDB
Found 4 hits for monomerid = 81511
Trg + Lig
Ki
nM
ΔG°
kcal/mole
IC50
nM
Kd
nM
EC50/IC50
nM
koff
s-1
kon
M-1s-1
pHTemp
°C
Sentrin-specific protease 1 (SENP1)
(Homo sapiens (Human))
BDBM81511
(VEA-260)
Show SMILES OC(=O)c1cccc(c1)C(=O)NCc1ccc(cc1)C(=O)NNC(=O)[C@H]1O[C@@H]1C(=O)N(Cc1cccc2ccccc12)Cc1cccc2ccccc12 |r|
Show InChI InChI=1S/C42H34N4O7/c47-38(30-12-7-13-31(22-30)42(51)52)43-23-26-18-20-29(21-19-26)39(48)44-45-40(49)36-37(53-36)41(50)46(24-32-14-5-10-27-8-1-3-16-34(27)32)25-33-15-6-11-28-9-2-4-17-35(28)33/h1-22,36-37H,23-25H2,(H,43,47)(H,44,48)(H,45,49)(H,51,52)/t36-,37-/m0/s1
Reactome pathway
n/an/a 7.10E+3n/an/an/an/a8.037
Stanford University
Assay Description
The fluorogenic substrate library screen was performed with hSENP1 in low salt tris buffer at final concentration of 2uM. Fluorophore release (AFC) ...
Chem Biol 18: 722-32 (2011)
Article DOI: 10.1016/j.chembiol.2011.05.008
BindingDB Entry DOI: 10.7270/Q2542M2N
Sentrin-specific protease 7 (SENP7)
(Homo sapiens (Human))
BDBM81511
(VEA-260)
Show SMILES OC(=O)c1cccc(c1)C(=O)NCc1ccc(cc1)C(=O)NNC(=O)[C@H]1O[C@@H]1C(=O)N(Cc1cccc2ccccc12)Cc1cccc2ccccc12 |r|
Show InChI InChI=1S/C42H34N4O7/c47-38(30-12-7-13-31(22-30)42(51)52)43-23-26-18-20-29(21-19-26)39(48)44-45-40(49)36-37(53-36)41(50)46(24-32-14-5-10-27-8-1-3-16-34(27)32)25-33-15-6-11-28-9-2-4-17-35(28)33/h1-22,36-37H,23-25H2,(H,43,47)(H,44,48)(H,45,49)(H,51,52)/t36-,37-/m0/s1
n/an/a 3.65E+4n/an/an/an/a8.037
Stanford University
Assay Description
The fluorogenic substrate library screen was performed with hSENP1 in low salt tris buffer at final concentration of 2uM. Fluorophore release (AFC) ...
Chem Biol 18: 722-32 (2011)
Article DOI: 10.1016/j.chembiol.2011.05.008
BindingDB Entry DOI: 10.7270/Q2542M2N
SUMO-1-specific protease
(Homo sapiens (Human))
BDBM81511
(VEA-260)
Show SMILES OC(=O)c1cccc(c1)C(=O)NCc1ccc(cc1)C(=O)NNC(=O)[C@H]1O[C@@H]1C(=O)N(Cc1cccc2ccccc12)Cc1cccc2ccccc12 |r|
Show InChI InChI=1S/C42H34N4O7/c47-38(30-12-7-13-31(22-30)42(51)52)43-23-26-18-20-29(21-19-26)39(48)44-45-40(49)36-37(53-36)41(50)46(24-32-14-5-10-27-8-1-3-16-34(27)32)25-33-15-6-11-28-9-2-4-17-35(28)33/h1-22,36-37H,23-25H2,(H,43,47)(H,44,48)(H,45,49)(H,51,52)/t36-,37-/m0/s1
n/an/a>1.00E+5n/an/an/an/a8.037
Stanford University
Assay Description
The fluorogenic substrate library screen was performed with hSENP1 in low salt tris buffer at final concentration of 2uM. Fluorophore release (AFC) ...
Chem Biol 18: 722-32 (2011)
Article DOI: 10.1016/j.chembiol.2011.05.008
BindingDB Entry DOI: 10.7270/Q2542M2N
Sentrin-specific protease 2 (SENP2)
(Homo sapiens (Human))
BDBM81511
(VEA-260)
Show SMILES OC(=O)c1cccc(c1)C(=O)NCc1ccc(cc1)C(=O)NNC(=O)[C@H]1O[C@@H]1C(=O)N(Cc1cccc2ccccc12)Cc1cccc2ccccc12 |r|
Show InChI InChI=1S/C42H34N4O7/c47-38(30-12-7-13-31(22-30)42(51)52)43-23-26-18-20-29(21-19-26)39(48)44-45-40(49)36-37(53-36)41(50)46(24-32-14-5-10-27-8-1-3-16-34(27)32)25-33-15-6-11-28-9-2-4-17-35(28)33/h1-22,36-37H,23-25H2,(H,43,47)(H,44,48)(H,45,49)(H,51,52)/t36-,37-/m0/s1
Reactome pathway
n/an/a 3.70E+3n/an/an/an/a8.037
Stanford University
Assay Description
The fluorogenic substrate library screen was performed with hSENP1 in low salt tris buffer at final concentration of 2uM. Fluorophore release (AFC) ...
Chem Biol 18: 722-32 (2011)
Article DOI: 10.1016/j.chembiol.2011.05.008
BindingDB Entry DOI: 10.7270/Q2542M2N