null
SMILES: CCCCSc1nc2n(C)c(=O)n(C)c(=S)c2[nH]1
InChI Key: InChIKey=JTKHAEGWWHAFTM-UHFFFAOYSA-N
Activity Spreadsheet -- Enzyme Inhibition Constant Data from BindingDB
Found 1 hit for monomerid = 83845
Trg + Lig
Ki
nM
ΔG°
kcal/mole
IC50
nM
Kd
nM
EC50/IC50
nM
koff
s-1
kon
M-1s-1
pHTemp
°C
Orotidine 5'-phosphate decarboxylase
(Aspergillus niger)
BDBM83845
(6-Thio-8-N-butylthiotheophylline | 8-(butylthio)-1...)
Show SMILES CCCCSc1nc2n(C)c(=O)n(C)c(=S)c2[nH]1
Show InChI InChI=1S/C11H16N4OS2/c1-4-5-6-18-10-12-7-8(13-10)14(2)11(16)15(3)9(7)17/h4-6H2,1-3H3,(H,12,13)
PCBioAssay
n/an/an/an/a>5.95E+4n/an/an/an/a
The Scripps Research Institute Molecular Screening Center
Curated by PubChem BioAssay
Assay Description
Source (MLPCN Center Name): The Scripps Research Institute Molecular Screening Center (SRISMC) Center Affiliation: The Scripps Research Institute, TS...
PubChem Bioassay (2011)
BindingDB Entry DOI: 10.7270/Q2PK0DN5