BDBM8574 4-Acylamino-6-arylfuro[2,3-d]pyrimidine 19::N-[6-(pyridin-3-yl)furo[2,3-d]pyrimidin-4-yl]cyclopropanecarboxamide
SMILES: O=C(Nc1ncnc2oc(cc12)-c1cccnc1)C1CC1
InChI Key: InChIKey=WMJDKJPJZVMOIF-UHFFFAOYSA-N
Data: 4 IC50
Activity Spreadsheet -- Enzyme Inhibition Constant Data from BindingDB
Found 4 hits for monomerid = 8574
Trg + Lig
Ki
nM
ΔG°
kcal/mole
IC50
nM
Kd
nM
EC50/IC50
nM
koff
s-1
kon
M-1s-1
pHTemp
°C
Glycogen synthase kinase-3 beta
(Homo sapiens (Human))
BDBM8574
(4-Acylamino-6-arylfuro[2,3-d]pyrimidine 19 | N-[6-...)
Show SMILES O=C(Nc1ncnc2oc(cc12)-c1cccnc1)C1CC1
Show InChI InChI=1S/C15H12N4O2/c20-14(9-3-4-9)19-13-11-6-12(10-2-1-5-16-7-10)21-15(11)18-8-17-13/h1-2,5-9H,3-4H2,(H,17,18,19,20)
NCI pathway
Reactome pathway
n/an/a 5n/an/an/an/a7.222
Tsukuba Research Laboratories
Assay Description
The biochemical activity of compounds was determined by incubation with specific enzyme and substrate in the presence 2.5 uM ATP/ [gamma-32P] ATP. Af...
Bioorg Med Chem Lett 14: 3907-11 (2004)
Article DOI: 10.1016/j.bmcl.2004.05.064
BindingDB Entry DOI: 10.7270/Q2XD0ZWC
Glycogen synthase kinase-3 beta
(Homo sapiens (Human))
BDBM8574
(4-Acylamino-6-arylfuro[2,3-d]pyrimidine 19 | N-[6-...)
Show SMILES O=C(Nc1ncnc2oc(cc12)-c1cccnc1)C1CC1
Show InChI InChI=1S/C15H12N4O2/c20-14(9-3-4-9)19-13-11-6-12(10-2-1-5-16-7-10)21-15(11)18-8-17-13/h1-2,5-9H,3-4H2,(H,17,18,19,20)
NCI pathway
Reactome pathway
n/an/a 5n/an/an/an/an/an/a
Wuhan Institute of Technology
Curated by ChEMBL
Assay Description
Inhibition of human Protein kinase C beta 2
Eur J Med Chem 164: 448-470 (2019)
Article DOI: 10.1007/s00044-005-0126-y
BindingDB Entry DOI: 10.7270/Q2WH2SVB
Cyclin-Dependent Kinase 2 (CDK2)
(Homo sapiens (Human))
BDBM8574
(4-Acylamino-6-arylfuro[2,3-d]pyrimidine 19 | N-[6-...)
Show SMILES O=C(Nc1ncnc2oc(cc12)-c1cccnc1)C1CC1
Show InChI InChI=1S/C15H12N4O2/c20-14(9-3-4-9)19-13-11-6-12(10-2-1-5-16-7-10)21-15(11)18-8-17-13/h1-2,5-9H,3-4H2,(H,17,18,19,20)
NCI pathway
Reactome pathway
n/an/a 447n/an/an/an/an/an/a
Tsukuba Research Laboratories
Assay Description
The biochemical activity of compounds was determined by incubation with specific enzymes and substrates in the presence 1.4 uM ATP/[gamma-32P] ATP. A...
Bioorg Med Chem Lett 14: 3907-11 (2004)
Article DOI: 10.1016/j.bmcl.2004.05.064
BindingDB Entry DOI: 10.7270/Q2XD0ZWC
Vascular endothelial growth factor receptor 2
(Homo sapiens (Human))
BDBM8574
(4-Acylamino-6-arylfuro[2,3-d]pyrimidine 19 | N-[6-...)
Show SMILES O=C(Nc1ncnc2oc(cc12)-c1cccnc1)C1CC1
Show InChI InChI=1S/C15H12N4O2/c20-14(9-3-4-9)19-13-11-6-12(10-2-1-5-16-7-10)21-15(11)18-8-17-13/h1-2,5-9H,3-4H2,(H,17,18,19,20)
NCI pathway
Reactome pathway
n/an/a 3.24E+3n/an/an/an/an/an/a
Tsukuba Research Laboratories
Assay Description
The assay was using baculovirus-expressed recombinant protein kinase purified as the intracellular domain fused by GST tag, interacting with biotinyl...
Bioorg Med Chem Lett 14: 3907-11 (2004)
Article DOI: 10.1016/j.bmcl.2004.05.064
BindingDB Entry DOI: 10.7270/Q2XD0ZWC