BDBM9093 (2S)-4-{[5-(4-chlorophenyl)furan-2-yl]methyl}-1-[(2S,4S)-2-hydroxy-4-{[(3S,4S)-3-hydroxy-3,4-dihydro-2H-1-benzopyran-4-yl]carbamoyl}-4-{thieno[3,2-c]pyridin-2-ylmethyl}butyl]-N-(2,2,2-trifluoroethyl)piperazine-2-carboxamide::pyridylthiophene analog 11
SMILES: O[C@@H](C[C@@H](Cc1cc2cnccc2s1)C(=O)N[C@@H]1[C@H](O)COc2ccccc12)CN1CCN(Cc2ccc(o2)-c2ccc(Cl)cc2)C[C@H]1C(=O)NCC(F)(F)F
InChI Key: InChIKey=JHXAGQHXTOUOAK-PDUYYWEESA-N
Data: 1 IC50
Activity Spreadsheet -- Enzyme Inhibition Constant Data from BindingDB
Found 1 hit for monomerid = 9093
Trg + Lig
Ki
nM
ΔG°
kcal/mole
IC50
nM
Kd
nM
EC50/IC50
nM
koff
s-1
kon
M-1s-1
pHTemp
°C
HIV-1 Protease
(Human immunodeficiency virus type 1)
BDBM9093
((2S)-4-{[5-(4-chlorophenyl)furan-2-yl]methyl}-1-[(...)
Show SMILES O[C@@H](C[C@@H](Cc1cc2cnccc2s1)C(=O)N[C@@H]1[C@H](O)COc2ccccc12)CN1CCN(Cc2ccc(o2)-c2ccc(Cl)cc2)C[C@H]1C(=O)NCC(F)(F)F |r|
Show InChI InChI=1S/C40H41ClF3N5O6S/c41-27-7-5-24(6-8-27)34-10-9-29(55-34)20-48-13-14-49(32(21-48)39(53)46-23-40(42,43)44)19-28(50)15-25(16-30-17-26-18-45-12-11-36(26)56-30)38(52)47-37-31-3-1-2-4-35(31)54-22-33(37)51/h1-12,17-18,25,28,32-33,37,50-51H,13-16,19-23H2,(H,46,53)(H,47,52)/t25-,28-,32-,33+,37-/m0/s1
n/an/a 0.0300n/an/an/an/a5.530
Merck Research Laboratories
Assay Description
Assay of HIV protease inhibition was performed by peptide cleavage using the substrate Val-Ser-Gln-Asn-beta-naphthylalanine*Pro-Ile-Val. Products of ...
Bioorg Med Chem Lett 15: 5311-4 (2005)
Article DOI: 10.1016/j.bmcl.2005.08.072
BindingDB Entry DOI: 10.7270/Q26Q1VF8