BDBM92359 Gangleoidin, 4
SMILES: COc1cc2OC(=O)c3c(C)c(Cl)c(O)c(Cl)c3Oc2c(C)c1C(O)=O
InChI Key: InChIKey=WQNZSMVUUOVALR-UHFFFAOYSA-N
Data: 1 IC50
Activity Spreadsheet -- Enzyme Inhibition Constant Data from BindingDB
Found 1 hit for monomerid = 92359
Trg + Lig
Ki
nM
ΔG°
kcal/mole
IC50
nM
Kd
nM
EC50/IC50
nM
koff
s-1
kon
M-1s-1
pHTemp
°C
Dual specificity mitogen-activated protein kinase kinase 6
(Homo sapiens (Human))
BDBM92359
(Gangleoidin, 4)
Show SMILES COc1cc2OC(=O)c3c(C)c(Cl)c(O)c(Cl)c3Oc2c(C)c1C(O)=O
Show InChI InChI=1S/C17H12Cl2O7/c1-5-10-15(12(19)13(20)11(5)18)26-14-6(2)9(16(21)22)7(24-3)4-8(14)25-17(10)23/h4,20H,1-3H3,(H,21,22)
Reactome pathway
n/an/a>2.50E+5n/an/an/an/an/an/a
Yale University School of Medicine
Assay Description
The labeled fragment can be distinguished from full-length MKK by a change in fluorescence polarization. MKK6 was used as a substrate because it cou...
Chem Biol 19: 875-82 (2012)
Article DOI: 10.1016/j.chembiol.2012.05.013
BindingDB Entry DOI: 10.7270/Q22B8WN0