BDBM92788 WAG-005
SMILES: CCCCc1oc2ccccc2c1C(=O)c1cc(I)c(OCCC[N+](C)(C)C)c(I)c1
InChI Key: InChIKey=SOFIRHJYYHVQEA-UHFFFAOYSA-N
Data: 13 IC50
Activity Spreadsheet -- Enzyme Inhibition Constant Data from BindingDB
Found 13 hits for monomerid = 92788
Trg + Lig
Ki
nM
ΔG°
kcal/mole
IC50
nM
Kd
nM
EC50/IC50
nM
koff
s-1
kon
M-1s-1
pHTemp
°C
Lysine-specific demethylase 5A
(Homo sapiens (Human))
BDBM92788
(WAG-005)
Show SMILES CCCCc1oc2ccccc2c1C(=O)c1cc(I)c(OCCC[N+](C)(C)C)c(I)c1
Show InChI InChI=1S/C25H30I2NO3/c1-5-6-11-22-23(18-10-7-8-12-21(18)31-22)24(29)17-15-19(26)25(20(27)16-17)30-14-9-13-28(2,3)4/h7-8,10,12,15-16H,5-6,9,11,13-14H2,1-4H3/q+1
Reactome pathway
n/an/a 4.10E+4n/an/an/an/an/an/a
University of Wisconsin
Assay Description
IC50 values of aminodarone analogues using JARID1A PHD3.
Biochemistry 51: 8293-306 (2012)
Article DOI: 10.1021/bi3009278
BindingDB Entry DOI: 10.7270/Q2028Q4T
Lysine-specific demethylase 5A
(Homo sapiens (Human))
BDBM92788
(WAG-005)
Show SMILES CCCCc1oc2ccccc2c1C(=O)c1cc(I)c(OCCC[N+](C)(C)C)c(I)c1
Show InChI InChI=1S/C25H30I2NO3/c1-5-6-11-22-23(18-10-7-8-12-21(18)31-22)24(29)17-15-19(26)25(20(27)16-17)30-14-9-13-28(2,3)4/h7-8,10,12,15-16H,5-6,9,11,13-14H2,1-4H3/q+1
Reactome pathway
n/an/a 3.00E+4n/an/an/an/an/an/a
University of Oxford
Curated by ChEMBL
Assay Description
Inhibition of recombinant GST-tagged KDM5A PHD3 (1601 to 1660 residues) (unknown origin) using biotin-H3K4me3 ( 1 to 14 residues) peptide substrate b...
J Med Chem 59: 1308-29 (2016)
BindingDB Entry DOI: 10.7270/Q2MP5559
Lysine-specific demethylase 4A
(Homo sapiens (Human))
BDBM92788
(WAG-005)
Show SMILES CCCCc1oc2ccccc2c1C(=O)c1cc(I)c(OCCC[N+](C)(C)C)c(I)c1
Show InChI InChI=1S/C25H30I2NO3/c1-5-6-11-22-23(18-10-7-8-12-21(18)31-22)24(29)17-15-19(26)25(20(27)16-17)30-14-9-13-28(2,3)4/h7-8,10,12,15-16H,5-6,9,11,13-14H2,1-4H3/q+1
n/an/a 3.40E+4n/an/an/an/an/an/a
University of Oxford
Curated by ChEMBL
Assay Description
Inhibition of recombinant GST-tagged KDM4A double tudor domain (895 to 1011 residues) (unknown origin) using biotin-H3K4me3 ( 1 to 14 residues) pepti...
J Med Chem 59: 1308-29 (2016)
BindingDB Entry DOI: 10.7270/Q2MP5559
Inhibitor of growth protein 2
(Homo sapiens (Human))
BDBM92788
(WAG-005)
Show SMILES CCCCc1oc2ccccc2c1C(=O)c1cc(I)c(OCCC[N+](C)(C)C)c(I)c1
Show InChI InChI=1S/C25H30I2NO3/c1-5-6-11-22-23(18-10-7-8-12-21(18)31-22)24(29)17-15-19(26)25(20(27)16-17)30-14-9-13-28(2,3)4/h7-8,10,12,15-16H,5-6,9,11,13-14H2,1-4H3/q+1
n/an/a 1.05E+5n/an/an/an/an/an/a
University of Oxford
Curated by ChEMBL
Assay Description
Inhibition of recombinant GST-tagged ING2 PHD (201 to 281 residues) (unknown origin) using biotin-H3K4me3 ( 1 to 14 residues) peptide substrate by fl...
J Med Chem 59: 1308-29 (2016)
BindingDB Entry DOI: 10.7270/Q2MP5559
Lysine-specific demethylase 5A
(Homo sapiens (Human))
BDBM92788
(WAG-005)
Show SMILES CCCCc1oc2ccccc2c1C(=O)c1cc(I)c(OCCC[N+](C)(C)C)c(I)c1
Show InChI InChI=1S/C25H30I2NO3/c1-5-6-11-22-23(18-10-7-8-12-21(18)31-22)24(29)17-15-19(26)25(20(27)16-17)30-14-9-13-28(2,3)4/h7-8,10,12,15-16H,5-6,9,11,13-14H2,1-4H3/q+1
Reactome pathway
n/an/a 8.20E+4n/an/an/an/an/an/a
University of Oxford
Curated by ChEMBL
Assay Description
Inhibition of KDM5A (M1 to L801 residues) PHD2/3 deletion mutant (unknown origin) demethylation activity preincubated for 10 mins followed by peptide...
Bioorg Med Chem 26: 2984-2991 (2018)
Article DOI: 10.1016/j.bmc.2018.03.030
BindingDB Entry DOI: 10.7270/Q2N01912
Lysine-specific demethylase 5A
(Homo sapiens (Human))
BDBM92788
(WAG-005)
Show SMILES CCCCc1oc2ccccc2c1C(=O)c1cc(I)c(OCCC[N+](C)(C)C)c(I)c1
Show InChI InChI=1S/C25H30I2NO3/c1-5-6-11-22-23(18-10-7-8-12-21(18)31-22)24(29)17-15-19(26)25(20(27)16-17)30-14-9-13-28(2,3)4/h7-8,10,12,15-16H,5-6,9,11,13-14H2,1-4H3/q+1
Reactome pathway
n/an/a 4.10E+4n/an/an/an/an/an/a
University of Oxford
Curated by ChEMBL
Assay Description
Displacement of H3K4me3 binding to Halo-tagged GST-fused KDM5A PHD3 domain (unknown origin) expressed in Escherichia coli by HaloTag-based peptide di...
Bioorg Med Chem 26: 2984-2991 (2018)
Article DOI: 10.1016/j.bmc.2018.03.030
BindingDB Entry DOI: 10.7270/Q2N01912
Lysine-specific demethylase 5A
(Homo sapiens (Human))
BDBM92788
(WAG-005)
Show SMILES CCCCc1oc2ccccc2c1C(=O)c1cc(I)c(OCCC[N+](C)(C)C)c(I)c1
Show InChI InChI=1S/C25H30I2NO3/c1-5-6-11-22-23(18-10-7-8-12-21(18)31-22)24(29)17-15-19(26)25(20(27)16-17)30-14-9-13-28(2,3)4/h7-8,10,12,15-16H,5-6,9,11,13-14H2,1-4H3/q+1
Reactome pathway
n/an/a 2.60E+4n/an/an/an/an/an/a
University of Connecticut
Curated by ChEMBL
Assay Description
Inhibition of recombinant HQ5-Halo-tagged JARID1A PHD3 finger domain (unknown origin) expressed in BL21(DE3)pLysS cells after 1 hr by chemiluminescen...
Eur J Med Chem 136: 14-35 (2017)
Article DOI: 10.1016/j.ejmech.2017.04.047
BindingDB Entry DOI: 10.7270/Q2F76G3G
Lysine-specific demethylase 5A
(Homo sapiens (Human))
BDBM92788
(WAG-005)
Show SMILES CCCCc1oc2ccccc2c1C(=O)c1cc(I)c(OCCC[N+](C)(C)C)c(I)c1
Show InChI InChI=1S/C25H30I2NO3/c1-5-6-11-22-23(18-10-7-8-12-21(18)31-22)24(29)17-15-19(26)25(20(27)16-17)30-14-9-13-28(2,3)4/h7-8,10,12,15-16H,5-6,9,11,13-14H2,1-4H3/q+1
Reactome pathway
n/an/a 5.62E+5n/an/an/an/an/an/a
University of Oxford
Curated by ChEMBL
Assay Description
Displacement of C-terminally biotinylated-H3K4me3 (1 to 21 residues) peptide from recombinant His6-tagged human KDM5A (PHD3) (1542 to 1660 residues) ...
Bioorg Med Chem 26: 2984-2991 (2018)
Article DOI: 10.1016/j.bmc.2018.03.030
BindingDB Entry DOI: 10.7270/Q2N01912
Lysine-specific demethylase 7
(Homo sapiens (Human))
BDBM92788
(WAG-005)
Show SMILES CCCCc1oc2ccccc2c1C(=O)c1cc(I)c(OCCC[N+](C)(C)C)c(I)c1
Show InChI InChI=1S/C25H30I2NO3/c1-5-6-11-22-23(18-10-7-8-12-21(18)31-22)24(29)17-15-19(26)25(20(27)16-17)30-14-9-13-28(2,3)4/h7-8,10,12,15-16H,5-6,9,11,13-14H2,1-4H3/q+1
Reactome pathway
n/an/a 1.60E+4n/an/an/an/an/an/a
University of Oxford
Curated by ChEMBL
Assay Description
Displacement of C-terminally biotinylated-H3K4me3 (1 to 21 residues) peptide from KDM7A (PHD-JmjC) (unknown origin) preincubated for 15 mins followed...
Bioorg Med Chem 26: 2984-2991 (2018)
Article DOI: 10.1016/j.bmc.2018.03.030
BindingDB Entry DOI: 10.7270/Q2N01912
Lysine-specific demethylase 5A
(Homo sapiens (Human))
BDBM92788
(WAG-005)
Show SMILES CCCCc1oc2ccccc2c1C(=O)c1cc(I)c(OCCC[N+](C)(C)C)c(I)c1
Show InChI InChI=1S/C25H30I2NO3/c1-5-6-11-22-23(18-10-7-8-12-21(18)31-22)24(29)17-15-19(26)25(20(27)16-17)30-14-9-13-28(2,3)4/h7-8,10,12,15-16H,5-6,9,11,13-14H2,1-4H3/q+1
Reactome pathway
n/an/a 2.70E+4n/an/an/an/an/an/a
University of Oxford
Curated by ChEMBL
Assay Description
Inhibition of KDM5A (M1 to L801 residues) PHD2/3 deletion mutant (unknown origin) demethylation activity preincubated for 10 mins followed by peptide...
Bioorg Med Chem 26: 2984-2991 (2018)
Article DOI: 10.1016/j.bmc.2018.03.030
BindingDB Entry DOI: 10.7270/Q2N01912
Lysine-specific demethylase 7A/7B
(Homo sapiens (Human))
BDBM92788
(WAG-005)
Show SMILES CCCCc1oc2ccccc2c1C(=O)c1cc(I)c(OCCC[N+](C)(C)C)c(I)c1
Show InChI InChI=1S/C25H30I2NO3/c1-5-6-11-22-23(18-10-7-8-12-21(18)31-22)24(29)17-15-19(26)25(20(27)16-17)30-14-9-13-28(2,3)4/h7-8,10,12,15-16H,5-6,9,11,13-14H2,1-4H3/q+1
Reactome pathway
n/an/a 5.00E+4n/an/an/an/an/an/a
University of Oxford
Curated by ChEMBL
Assay Description
Displacement of C-terminally biotinylated-H3K4me3 (1 to 21 residues) peptide from KDM7A (PHD) (unknown origin) preincubated for 15 mins followed by p...
Bioorg Med Chem 26: 2984-2991 (2018)
Article DOI: 10.1016/j.bmc.2018.03.030
BindingDB Entry DOI: 10.7270/Q2N01912
Lysine-specific demethylase PHF2
(Homo sapiens)
BDBM92788
(WAG-005)
Show SMILES CCCCc1oc2ccccc2c1C(=O)c1cc(I)c(OCCC[N+](C)(C)C)c(I)c1
Show InChI InChI=1S/C25H30I2NO3/c1-5-6-11-22-23(18-10-7-8-12-21(18)31-22)24(29)17-15-19(26)25(20(27)16-17)30-14-9-13-28(2,3)4/h7-8,10,12,15-16H,5-6,9,11,13-14H2,1-4H3/q+1
n/an/a 7.40E+5n/an/an/an/an/an/a
University of Oxford
Curated by ChEMBL
Assay Description
Displacement of C-terminally biotinylated-H3K4me3 (1 to 21 residues) peptide from KDM7C (PHD) (unknown origin) preincubated for 15 mins followed by p...
Bioorg Med Chem 26: 2984-2991 (2018)
Article DOI: 10.1016/j.bmc.2018.03.030
BindingDB Entry DOI: 10.7270/Q2N01912
Histone lysine demethylase PHF8
(Homo sapiens (Human))
BDBM92788
(WAG-005)
Show SMILES CCCCc1oc2ccccc2c1C(=O)c1cc(I)c(OCCC[N+](C)(C)C)c(I)c1
Show InChI InChI=1S/C25H30I2NO3/c1-5-6-11-22-23(18-10-7-8-12-21(18)31-22)24(29)17-15-19(26)25(20(27)16-17)30-14-9-13-28(2,3)4/h7-8,10,12,15-16H,5-6,9,11,13-14H2,1-4H3/q+1
n/an/a 3.90E+5n/an/an/an/an/an/a
University of Oxford
Curated by ChEMBL
Assay Description
Displacement of C-terminally biotinylated-H3K4me3 (1 to 21 residues) peptide from KDM7B (PHD) (unknown origin) preincubated for 15 mins followed by p...
Bioorg Med Chem 26: 2984-2991 (2018)
Article DOI: 10.1016/j.bmc.2018.03.030
BindingDB Entry DOI: 10.7270/Q2N01912