BDBM9848 (2S)-2-{[(benzyloxy)carbonyl]amino}-6-{[(tert-butoxy)carbonyl]amino}hexanoic acid::Lysine derivative 1
SMILES: CC(C)(C)OC(=O)NCCCC[C@H](NC(=O)OCc1ccccc1)C(O)=O
InChI Key: InChIKey=DYSBKEOCHROEGX-HNNXBMFYSA-N
Data: 1 KI
Activity Spreadsheet -- Enzyme Inhibition Constant Data from BindingDB
Found 1 hit for monomerid = 9848
Trg + Lig
Ki
nM
ΔG°
kcal/mole
IC50
nM
Kd
nM
EC50/IC50
nM
koff
s-1
kon
M-1s-1
pHTemp
°C
HIV-1 Protease
(Human immunodeficiency virus type 1)
BDBM9848
((2S)-2-{[(benzyloxy)carbonyl]amino}-6-{[(tert-buto...)
Show SMILES CC(C)(C)OC(=O)NCCCC[C@H](NC(=O)OCc1ccccc1)C(O)=O |r|
Show InChI InChI=1S/C19H28N2O6/c1-19(2,3)27-17(24)20-12-8-7-11-15(16(22)23)21-18(25)26-13-14-9-5-4-6-10-14/h4-6,9-10,15H,7-8,11-13H2,1-3H3,(H,20,24)(H,21,25)(H,22,23)/t15-/m0/s1
>1.00E+5>-5.54n/an/an/an/an/a4.730
Pharmacor Inc
Assay Description
HIV-1 protease activity was measured by a continuous fluorometric assay using the internally quenched fluorogenic substrate DABCYL-Ser-Gln-Asn-Tyr-Pr...
Bioorg Med Chem Lett 15: 1509-13 (2005)
Article DOI: 10.1016/j.bmcl.2004.12.068
BindingDB Entry DOI: 10.7270/Q2Z31WW4