Reaction Details
TargetNociceptin receptor
LigandBDBM172382
Substrate/Competitorn/a
Meas. Tech.In Vitro Delta-Opioid Receptor Binding Assay
Ki 1.90±0.4 nM
Citation Tanaka, NYamawaki, KYao, JYu, JZhou, X Substituted benzimidazole-type piperidine compounds and uses thereof US Patent US9598411 Publication Date 3/21/2017
 
Nociceptin receptor
Name:Nociceptin receptor
Type:G Protein-Coupled Receptor (GPCR)
Mol. Mass.:40702.87
Organism:Homo sapiens (Human)
Description:P41146
Residue:370
BDBM172382
NameBDBM172382
Synonyms:US9090618, H27b(i) | US9598411, Ref. No. H27b(i)
TypeSmall organic molecule
Emp. Form.C29H42N4
Mol. Mass.446.6706
SMILESC1CNC(C1)c1nc2ccccc2n1[C@@H]1C[C@@H]2CCC[C@H](C1)N2[C@H]1C[C@@H]2C[C@H](C1)CCCC2