Reaction Details
TargetPlatelet-derived growth factor receptor beta
LigandBDBM507078
Substrate/Competitorn/a
Meas. Tech.PDGFRbeta Enzyme Inhibition
Ki 4.77±n/a nM
Citation Walters, IBirch, LHill-Cousins, JCollingwood, SPStevenson, CS Indolinones compounds and their use in the treatment of fibrotic diseases US Patent US11046672 Publication Date 6/29/2021
 
Platelet-derived growth factor receptor beta
Name:Platelet-derived growth factor receptor beta
Type:Enzyme
Mol. Mass.:123922.25
Organism:Homo sapiens (Human)
Description:P09619
Residue:1106
BDBM507078
NameBDBM507078
Synonyms:US11046672, Example 27
TypeSmall organic molecule
Emp. Form.C30H32N4O5
Mol. Mass.528.5989
SMILESCOC(=O)c1cc2NC(=O)\C(=C(/Nc3ccc(cc3)C(=O)NOCCCN(C)C)c3ccccc3)c2cc1C