Reaction Details
TargetFibroblast growth factor receptor 3
LigandBDBM302362
Substrate/Competitorn/a
IC50 0.200±n/a nM
Citation Collin, MBrohm, DHéroult, MLobell, MHübsch, WLustig, KGrünewald, SBömer, UVöhringer, VLindner, N Substituted benzothienyl-pyrrolotriazines and uses thereof in the treatment cancer US Patent US9598416 Publication Date 3/21/2017
 
Fibroblast growth factor receptor 3
Name:Fibroblast growth factor receptor 3
Type:Protein
Mol. Mass.:87699.57
Organism:Homo sapiens (Human)
Description:P22607
Residue:806
BDBM302362
NameBDBM302362
Synonyms:6-[(2-Aminoethoxy)methyl]-5-(7-methoxy-5-methyl-1-benzothiophen-2-yl)pyrrolo[2,14][1,2,4]-triazin-4-amine dihydrochloride | US9598416, Example 8
TypeSmall organic molecule
Emp. Form.C19H21N5O2S
Mol. Mass.383.467
SMILESCOc1cc(C)cc2cc(sc12)-c1c(COCCN)cn2ncnc(N)c12