Reaction Details
TargetIsocitrate dehydrogenase [NADP] cytoplasmic [R132H]
LigandBDBM303078
Substrate/Competitorn/a
Meas. Tech.Mutant IDH1 R132H Biochemical Assay
IC50 70.0±n/a nM
Citation Rehwinkel, HAnlauf, SNguyen, DPanknin, OBauser, MZimmermann, KKaulfuss, SNeuhaus, RBlaney, PMToschi, G 1-cyclohexyl-2-phenylaminobenzimidazoles as mIDH1 inhibitors for the treatment of tumors US Patent US10137110 Publication Date 11/27/2018
 
Isocitrate dehydrogenase [NADP] cytoplasmic [R132H]
Name:Isocitrate dehydrogenase [NADP] cytoplasmic [R132H]
Type:Protein
Mol. Mass.:46641.74
Organism:Homo sapiens (Human)
Description:Human IDH1 R132H (SEQ ID No. 2 in patent). First three are removed. Google patent parsed wrong.
Residue:414
BDBM303078
NameBDBM303078
Synonyms:US10137110, Example 2-2
TypeSmall organic molecule
Emp. Form.C30H30F3N3O3
Mol. Mass.537.5727
SMILESC[C@H]1C[C@@H](CC(C)(C)C1)n1c(Nc2ccc(OC(F)(F)F)cc2)nc2cc(ccc12)-c1cccc(c1)C(O)=O