Reaction Details
TargetGlycogen synthase kinase-3 beta
LigandBDBM173195
Substrate/Competitorn/a
Meas. Tech.ADP Glo Assay Protocol
IC50 550±n/a nM
Citation Wagner, FFPan, JQDandapani, SGermain, AHolson, EMunoz, BNag, PPLewis, MCHaggarty, SJBishop, JAStegmaier, KWeiwer, MBanerji, V Kinase inhibitors and methods of use thereof US Patent US10137122 Publication Date 11/27/2018
 
Glycogen synthase kinase-3 beta
Name:Glycogen synthase kinase-3 beta
Type:Enzyme
Mol. Mass.:46756.38
Organism:Homo sapiens (Human)
Description:P49841
Residue:420
BDBM173195
NameBDBM173195
Synonyms:US10137122, Compound 3 | US9096594, 3
TypeSmall organic molecule
Emp. Form.C19H21N3O
Mol. Mass.307.3895
SMILESCc1[nH]nc2NC3=C([C@H](c12)c1ccccc1)C(=O)CC(C)(C)C3