Reaction Details
TargetGlycogen synthase kinase-3 beta
LigandBDBM303153
Substrate/Competitorn/a
Meas. Tech.Secondary Surface Plasmon Resonance Affinity Determination
Kd 124000±n/a nM
Citation Wagner, FFPan, JQDandapani, SGermain, AHolson, EMunoz, BNag, PPLewis, MCHaggarty, SJBishop, JAStegmaier, KWeiwer, MBanerji, V Kinase inhibitors and methods of use thereof US Patent US10137122 Publication Date 11/27/2018
 
Glycogen synthase kinase-3 beta
Name:Glycogen synthase kinase-3 beta
Type:Enzyme
Mol. Mass.:46756.38
Organism:Homo sapiens (Human)
Description:P49841
Residue:420
BDBM303153
NameBDBM303153
Synonyms:US10137122, Compound 25
TypeSmall organic molecule
Emp. Form.C20H23N3OS
Mol. Mass.353.481
SMILESCSc1ccccc1C1c2c(C)[nH]nc2NC2=C1C(=O)CC(C)(C)C2