Reaction Details
TargetGlycogen synthase kinase-3 beta
LigandBDBM303161
Substrate/Competitorn/a
Meas. Tech.Secondary Surface Plasmon Resonance Affinity Determination
Kd 131000±n/a nM
Citation Wagner, FFPan, JQDandapani, SGermain, AHolson, EMunoz, BNag, PPLewis, MCHaggarty, SJBishop, JAStegmaier, KWeiwer, MBanerji, V Kinase inhibitors and methods of use thereof US Patent US10137122 Publication Date 11/27/2018
 
Glycogen synthase kinase-3 beta
Name:Glycogen synthase kinase-3 beta
Type:Enzyme
Mol. Mass.:46756.38
Organism:Homo sapiens (Human)
Description:P49841
Residue:420
BDBM303161
NameBDBM303161
Synonyms:US10137122, Compound 33
TypeSmall organic molecule
Emp. Form.C20H20N4O
Mol. Mass.332.399
SMILESCc1[nH]nc2NC3=C(C(c12)c1cccc(c1)C#N)C(=O)CC(C)(C)C3