Reaction Details
TargetGlycogen synthase kinase-3 alpha
LigandBDBM188504
Substrate/Competitorn/a
Meas. Tech.Caliper Assay
IC50 3000±n/a nM
Citation Wagner, FFPan, JQDandapani, SGermain, AHolson, EMunoz, BNag, PPLewis, MCHaggarty, SJBishop, JAStegmaier, KWeiwer, MBanerji, V Kinase inhibitors and methods of use thereof US Patent US10137122 Publication Date 11/27/2018
 
Glycogen synthase kinase-3 alpha
Name:Glycogen synthase kinase-3 alpha
Type:Enzyme
Mol. Mass.:50991.79
Organism:Homo sapiens (Human)
Description:P49840
Residue:483
BDBM188504
NameBDBM188504
Synonyms:3,7,7-trimethyl-4-(pyridin-4-yl)-2,4,6,7,8,9-hexahydro-5H-pyrazolo[3,4-b]quinolin-5-one (7) | US10137122, Compound 38
TypeSmall organic molecule
Emp. Form.C18H20N4O
Mol. Mass.308.3776
SMILESCc1[nH]nc2NC3=C(C(c12)c1ccncc1)C(=O)CC(C)(C)C3