Reaction Details
TargetGlycogen synthase kinase-3 beta
LigandBDBM188500
Substrate/Competitorn/a
Meas. Tech.ADP Glo Assay Protocol
IC50 550±n/a nM
Citation Wagner, FFPan, JQDandapani, SGermain, AHolson, EMunoz, BNag, PPLewis, MCHaggarty, SJBishop, JAStegmaier, KWeiwer, MBanerji, V Kinase inhibitors and methods of use thereof US Patent US10137122 Publication Date 11/27/2018
 
Glycogen synthase kinase-3 beta
Name:Glycogen synthase kinase-3 beta
Type:Enzyme
Mol. Mass.:46756.38
Organism:Homo sapiens (Human)
Description:P49841
Residue:420
BDBM188500
NameBDBM188500
Synonyms:3,4,7,7-Tetramethyl-2,4,6,7,8,9-hexahydro-5H-pyrazolo[3,4-b]quinolin-5-one (3) | US10137122, Compound 42
TypeSmall organic molecule
Emp. Form.C14H19N3O
Mol. Mass.245.3202
SMILESCC1c2c(C)[nH]nc2NC2=C1C(=O)CC(C)(C)C2