Reaction Details
TargetGlycogen synthase kinase-3 alpha
LigandBDBM188514
Substrate/Competitorn/a
Meas. Tech.Caliper Assay
IC50<100±n/a nM
Citation Wagner, FFPan, JQDandapani, SGermain, AHolson, EMunoz, BNag, PPLewis, MCHaggarty, SJBishop, JAStegmaier, KWeiwer, MBanerji, V Kinase inhibitors and methods of use thereof US Patent US10137122 Publication Date 11/27/2018
 
Glycogen synthase kinase-3 alpha
Name:Glycogen synthase kinase-3 alpha
Type:Enzyme
Mol. Mass.:50991.79
Organism:Homo sapiens (Human)
Description:P49840
Residue:483
BDBM188514
NameBDBM188514
Synonyms:4,7,7-trimethyl-4-phenyl-3-(trifluoromethyl)-2,4,6,7,8,9-hexahydro-5H-pyrazolo[3,4-b]quinolin-5-one (BRD1652) | US10137122, Compound 70
TypeSmall organic molecule
Emp. Form.C20H20F3N3O
Mol. Mass.375.3875
SMILESCC1(C)CC(=O)C2=C(C1)Nc1n[nH]c(c1[C@]2(C)c1ccccc1)C(F)(F)F