Reaction Details
TargetGlycogen synthase kinase-3 alpha
LigandBDBM303237
Substrate/Competitorn/a
Meas. Tech.Caliper Assay
IC50<100±n/a nM
Citation Wagner, FFPan, JQDandapani, SGermain, AHolson, EMunoz, BNag, PPLewis, MCHaggarty, SJBishop, JAStegmaier, KWeiwer, MBanerji, V Kinase inhibitors and methods of use thereof US Patent US10137122 Publication Date 11/27/2018
 
Glycogen synthase kinase-3 alpha
Name:Glycogen synthase kinase-3 alpha
Type:Enzyme
Mol. Mass.:50991.79
Organism:Homo sapiens (Human)
Description:P49840
Residue:483
BDBM303237
NameBDBM303237
Synonyms:US10137122, Compound 112
TypeSmall organic molecule
Emp. Form.C22H22F3N3O
Mol. Mass.401.4248
SMILESCC1(C)CC(=O)C2=C(C1)Nc1n[nH]c(C3CC3)c1C2(c1ccccc1)C(F)(F)F