Reaction Details
TargetAdenosine receptor A2a
LigandBDBM303260
Substrate/Competitorn/a
Meas. Tech.A2a Ki assay
Ki 1.40±n/a nM
Citation Ali, AKuang, RLim, YLo, MMTing, PCBiju, Pde Lera Ruiz, MDegrado, SJTung, ALHenderson, TJHong, LKim, JKim, DWLee, JWu, JWu, HXiao, YYu, TZhou, GZhu, XMcCormick, KDTagat, JRXiao, DKhan, TCao, JBerlin, MZhang, Y Aminoquinazoline compounds as A2A antagonist US Patent US10138212 Publication Date 11/27/2018
 
Adenosine receptor A2a
Name:Adenosine receptor A2a
Type:G Protein-Coupled Receptor (GPCR)
Mol. Mass.:44716.46
Organism:Homo sapiens (Human)
Description:P29274
Residue:412
BDBM303260
NameBDBM303260
Synonyms:2-amino-N-[(3-fluoro-2- pyridyl)methyl]-8- methoxy-quinazoline-4- carboxamide | US10138212, Example 25
TypeSmall organic molecule
Emp. Form.C16H14FN5O2
Mol. Mass.327.3131
SMILESCOc1cccc2c(nc(N)nc12)C(=O)NCc1ncccc1F