Reaction Details
TargetAdenosine receptor A2a
LigandBDBM303299
Substrate/Competitorn/a
Meas. Tech.A2a Ki assay
Ki 0.800±n/a nM
Citation Ali, AKuang, RLim, YLo, MMTing, PCBiju, Pde Lera Ruiz, MDegrado, SJTung, ALHenderson, TJHong, LKim, JKim, DWLee, JWu, JWu, HXiao, YYu, TZhou, GZhu, XMcCormick, KDTagat, JRXiao, DKhan, TCao, JBerlin, MZhang, Y Aminoquinazoline compounds as A2A antagonist US Patent US10138212 Publication Date 11/27/2018
 
Adenosine receptor A2a
Name:Adenosine receptor A2a
Type:G Protein-Coupled Receptor (GPCR)
Mol. Mass.:44716.46
Organism:Homo sapiens (Human)
Description:P29274
Residue:412
BDBM303299
NameBDBM303299
Synonyms:2-amino-8-fluoro-N-[[6- (2-pyridyl)-2- pyridyl]methyl] quinazoline-4- carboxamide | US10138212, Example 63
TypeSmall organic molecule
Emp. Form.C20H15FN6O
Mol. Mass.374.3711
SMILESNc1nc(C(=O)NCc2cccc(n2)-c2ccccn2)c2cccc(F)c2n1