Reaction Details
TargetAdenosine receptor A2a
LigandBDBM303315
Substrate/Competitorn/a
Meas. Tech.A2a Ki assay
Ki 1.000±n/a nM
Citation Ali, AKuang, RLim, YLo, MMTing, PCBiju, Pde Lera Ruiz, MDegrado, SJTung, ALHenderson, TJHong, LKim, JKim, DWLee, JWu, JWu, HXiao, YYu, TZhou, GZhu, XMcCormick, KDTagat, JRXiao, DKhan, TCao, JBerlin, MZhang, Y Aminoquinazoline compounds as A2A antagonist US Patent US10138212 Publication Date 11/27/2018
 
Adenosine receptor A2a
Name:Adenosine receptor A2a
Type:G Protein-Coupled Receptor (GPCR)
Mol. Mass.:44716.46
Organism:Homo sapiens (Human)
Description:P29274
Residue:412
BDBM303315
NameBDBM303315
Synonyms:2-amino-8-fluoro-N-[(6- isoppropoxy-2- pyridyl)methyl]quinazoline- 4-carboxamide | US10138212, Example 78
TypeSmall organic molecule
Emp. Form.C18H18FN5O2
Mol. Mass.355.3662
SMILESCC(C)Oc1cccc(CNC(=O)c2nc(N)nc3c(F)cccc23)n1