Reaction Details
TargetAdenosine receptor A2a
LigandBDBM303343
Substrate/Competitorn/a
Meas. Tech.A2a Ki assay
Ki 1.60±n/a nM
Citation Ali, AKuang, RLim, YLo, MMTing, PCBiju, Pde Lera Ruiz, MDegrado, SJTung, ALHenderson, TJHong, LKim, JKim, DWLee, JWu, JWu, HXiao, YYu, TZhou, GZhu, XMcCormick, KDTagat, JRXiao, DKhan, TCao, JBerlin, MZhang, Y Aminoquinazoline compounds as A2A antagonist US Patent US10138212 Publication Date 11/27/2018
 
Adenosine receptor A2a
Name:Adenosine receptor A2a
Type:G Protein-Coupled Receptor (GPCR)
Mol. Mass.:44716.46
Organism:Homo sapiens (Human)
Description:P29274
Residue:412
BDBM303343
NameBDBM303343
Synonyms:2-amino-N-[dideuterio- [6-[dideuterio-(6- morpholino-3- pyridyl)methyl]-2- pyridyl]methyl]-8- fluoro-quinazoline-4- carboxamide | US10138212, Example 105
TypeSmall organic molecule
Emp. Form.C26H27N7O3
Mol. Mass.489.5623
SMILES[2H]C([2H])(NC(=O)c1nc(N)nc2c(OC)cccc12)c1cccc(n1)C([2H])([2H])c1ccc(nc1)N1CCOCC1