Reaction Details
TargetPhosphatidylinositol 3-kinase C2 domain-containing subunit gamma
LigandBDBM50193031
Substrate/Competitorn/a
Meas. Tech.In Vitro Kinase Assay
IC50 2.00±n/a nM
Citation Gray, NSZhang, TFerguson, FMZhao, JNi, J Pyrimido-diazepinone kinase scaffold compounds and methods for treating PI3K-mediated disorders US Patent US11155556 Publication Date 10/26/2021
 
Phosphatidylinositol 3-kinase C2 domain-containing subunit gamma
Name:Phosphatidylinositol 3-kinase C2 domain-containing subunit gamma
Type:PROTEIN
Mol. Mass.:165726.35
Organism:Homo sapiens (Human)
Description:ChEMBL_1447686
Residue:1445
BDBM50193031
NameBDBM50193031
Synonyms:CHEMBL3959351 | US11155556, No. 12
TypeSmall organic molecule
Emp. Form.C25H28N6O4S
Mol. Mass.508.593
SMILESCN1c2ccc(C)cc2C(=O)N(C)c2cnc(Nc3cccc(c3)S(=O)(=O)N3CCC(O)CC3)nc12