Reaction Details
TargetAurora kinase A
LigandBDBM50193031
Substrate/Competitorn/a
Meas. Tech.In Vitro Kinase Assay
IC50 151±n/a nM
Citation Gray, NSZhang, TFerguson, FMZhao, JNi, J Pyrimido-diazepinone kinase scaffold compounds and methods for treating PI3K-mediated disorders US Patent US11155556 Publication Date 10/26/2021
 
Aurora kinase A
Name:Aurora kinase A
Type:Serine/threonine-protein kinase
Mol. Mass.:45830.98
Organism:Homo sapiens (Human)
Description:O14965
Residue:403
BDBM50193031
NameBDBM50193031
Synonyms:CHEMBL3959351 | US11155556, No. 12
TypeSmall organic molecule
Emp. Form.C25H28N6O4S
Mol. Mass.508.593
SMILESCN1c2ccc(C)cc2C(=O)N(C)c2cnc(Nc3cccc(c3)S(=O)(=O)N3CCC(O)CC3)nc12