Reaction Details
TargetTyrosine-protein kinase BTK
LigandBDBM303546
Substrate/Competitorn/a
Meas. Tech.BTK Assay
IC50 3.20±n/a nM
Citation Bentzien, JBerry, AKBosanac, TBurke, MJDisalvo, DTHoran, JCLiang, SMao, CMao, WShen, YSoleymanzadeh, FZindell, RM Heteroaromatic compounds as BTK inhibitors US Patent US10138229 Publication Date 11/27/2018
 
Tyrosine-protein kinase BTK
Name:Tyrosine-protein kinase BTK
Type:Enzyme
Mol. Mass.:76289.95
Organism:Homo sapiens (Human)
Description:Q06187
Residue:659
BDBM303546
NameBDBM303546
Synonyms:US10138229, Example 57 | US10875852, Example 57
TypeSmall organic molecule
Emp. Form.C25H23N3O3S
Mol. Mass.445.533
SMILESNC(=O)c1sc(nc1-c1ccc(Oc2ccccc2)cc1)C1CC2(C1)CN(C2)C(=O)C=C