Reaction Details
TargetTyrosine-protein kinase BTK
LigandBDBM303628
Substrate/Competitorn/a
Meas. Tech.BTK Assay
IC50 0.900±n/a nM
Citation Bentzien, JBerry, AKBosanac, TBurke, MJDisalvo, DTHoran, JCLiang, SMao, CMao, WShen, YSoleymanzadeh, FZindell, RM Heteroaromatic compounds as BTK inhibitors US Patent US10138229 Publication Date 11/27/2018
 
Tyrosine-protein kinase BTK
Name:Tyrosine-protein kinase BTK
Type:Enzyme
Mol. Mass.:76289.95
Organism:Homo sapiens (Human)
Description:Q06187
Residue:659
BDBM303628
NameBDBM303628
Synonyms:US10138229, Example 140 | US10875852, Example 140
TypeSmall organic molecule
Emp. Form.C24H29N5O3
Mol. Mass.435.5188
SMILESCCCOc1ccc(cc1)-c1nn([C@H]2C[C@]3(C2)CCN(C3)C(=O)C#CC)c(N)c1C(N)=O