Reaction Details
TargetReplicase polyprotein 1ab
LigandBDBM525176
Substrate/Competitorn/a
Meas. Tech.SARS-CoV 3CLp ro inhibition assay
IC50 16±n/a nM
Citation Chen, JLiang, CMIAO, KWu, YYun, HZhang, W Aminocarbamoyl compounds for the treatment of viral infections WIPOWO2022043374 Publication Date 3/3/2022
 
Replicase polyprotein 1ab
Name:Replicase polyprotein 1ab
Type:Protein
Mol. Mass.:790250.81
Organism:Human SARS coronavirus (SARS-CoV) (Severe acute respiratory syndrome coronavirus)
Description:P0C6X7
Residue:7073
BDBM525176
NameBDBM525176
Synonyms:N-[(1S)-1-[[(3-amino-3-oxo-propyl)-(2-chloroacetyl)amino]carbamoyl]-3-methyl-butyl]-1H-indole-2-carboxamide | WO2022043374, Example 28
TypeSmall organic molecule
Emp. Form.C20H26ClN5O5
Mol. Mass.451.904
SMILESCC(C)C[C@H](NC(=O)Oc1cc2ccccc2[nH]1)C(=O)NN(CCC(N)=O)C(=O)CCl