Reaction Details
TargetReplicase polyprotein 1ab
LigandBDBM525251
Substrate/Competitorn/a
Meas. Tech.SARS-CoV 3CLp ro inhibition assay
IC50 31±n/a nM
Citation Chen, JLiang, CMIAO, KWu, YYun, HZhang, W Aminocarbamoyl compounds for the treatment of viral infections WIPOWO2022043374 Publication Date 3/3/2022
 
Replicase polyprotein 1ab
Name:Replicase polyprotein 1ab
Type:Protein
Mol. Mass.:790250.81
Organism:Human SARS coronavirus (SARS-CoV) (Severe acute respiratory syndrome coronavirus)
Description:P0C6X7
Residue:7073
BDBM525251
NameBDBM525251
Synonyms:N-[(1S)-2-[2-[(2R)-2-chloro-2-fluoro-acetyl]-2-[[(3S)-2-oxopyrrolidin-3-yl]methyl]hydrazino]-1-[(1-methylcyclopropyl)methyl]-2-oxo-ethyl]-5-(difluoromethyl)isoxazole-3-carboxamide | WO2022043374, Example 100
TypeSmall organic molecule
Emp. Form.C20H23ClF3N5O5
Mol. Mass.505.875
SMILESFC(F)c1cc(no1)C(=O)N[C@@H](CC12CC(C1)C2)C(=O)NN(C[C@@H]1CCNC1=O)C(=O)[C@H](F)Cl