Reaction Details
TargetOxysterols receptor LXR-beta
LigandBDBM304365
Substrate/Competitorn/a
Meas. Tech.LXR alpha/beta Radioligand Binding Assay
Ki 8.00±n/a nM
Citation Claremon, DADong, CFan, YLeftheris, KLotesta, SDSingh, SBTice, CMZhao, WZheng, YZhuang, L Piperazine derivatives as liver X receptor modulators US Patent US10144715 Publication Date 12/4/2018
 
Oxysterols receptor LXR-beta
Name:Oxysterols receptor LXR-beta
Type:Enzyme Catalytic Domain
Mol. Mass.:50978.79
Organism:Homo sapiens (Human)
Description:P55055
Residue:460
BDBM304365
NameBDBM304365
Synonyms:(R)-1-(3-chloro-5-(trifluoromethyl)pyridin-2-yl)-4-(4-fluoro-3-(methylsulfonyl)phenyl)-2-isopropylpiperazine | US10144715, Compound 7-41
TypeSmall organic molecule
Emp. Form.C20H23ClF3N3O2S
Mol. Mass.461.929
SMILESCC(C)[C@@H]1CN(CCN1c1nc(ccc1Cl)C(F)(F)F)c1cccc(c1)S(C)(=O)=O