Reaction Details
TargetOxysterols receptor LXR-beta
LigandBDBM304378
Substrate/Competitorn/a
Meas. Tech.LXR alpha/beta Radioligand Binding Assay
Ki 9.00±n/a nM
Citation Claremon, DADong, CFan, YLeftheris, KLotesta, SDSingh, SBTice, CMZhao, WZheng, YZhuang, L Piperazine derivatives as liver X receptor modulators US Patent US10144715 Publication Date 12/4/2018
 
Oxysterols receptor LXR-beta
Name:Oxysterols receptor LXR-beta
Type:Enzyme Catalytic Domain
Mol. Mass.:50978.79
Organism:Homo sapiens (Human)
Description:P55055
Residue:460
BDBM304378
NameBDBM304378
Synonyms:(R)-4-fluoro-2-(4-(4-fluoro-3-(methylsulfonyl)phenyl)-2-isopropylpiperazin-1-yl)benzo[d]thiazole | US10144715, Compound 7-54
TypeSmall organic molecule
Emp. Form.C21H23F2N3O2S2
Mol. Mass.451.553
SMILESCC(C)[C@@H]1CN(CCN1c1nc2c(F)cccc2s1)c1ccc(F)c(c1)S(C)(=O)=O